program: Orca
programVersion: 4.2.1
elementType: Cl Cl F F F F O N N N C C C C C C C C C C C C C H H H H H H H H H H H
charge: 0
multiplicity: 1
keywords: wb97x-d3
keywords: def2-TZVPP
keywords: def2/J RIJCOSX GRIDX6 NOFINALGRIDX
keywords: grid4 nofinalgrid
keywords: scfconv7
keywords: smallprint printgap noloewdin
keywords: NOSOSCF
formula: C13H11Cl2F4N3O
InChI: InChI=1S/C13H11Cl2F4N3O/c14-9-1-2-10(11(15)3-9)8(4-22-7-20-6-21-22)5-23-13(18,19)12(16)17/h1-3,6-8,12H,4-5H2
34 atoms
Cl -1.896441 0.74626 -2.851082
Cl -4.400081 4.560775 -0.071632
F  3.367094 0.379928 1.320789
F  2.54323 -1.425362 2.161792
F  4.925933 -1.830607 0.983668
F  4.204052 -0.973656 -0.89021
O  1.724325 -0.667694 0.226326
N  -0.513031 -2.506368 0.33307
N  -0.04907 -3.101495 -0.766565
N  0.73076 -4.126769 1.071768
C  -0.540128 -0.071054 -0.188331
C  -1.318536 -1.311136 0.268136
C  0.689328 0.225959 0.663052
C  -1.495528 1.095816 -0.183595
C  -2.155156 1.533846 -1.329686
C  -1.790426 1.760117 1.005443
C  2.8145 -0.809674 0.983138
C  -3.04515 2.597287 -1.310818
C  -2.676156 2.821975 1.059797
C  -0.030282 -3.114807 1.414953
C  -3.294216 3.234049 -0.108276
C  3.829036 -1.65497 0.214805
C  0.688816 -4.061865 -0.271801
H  -0.189604 -0.235737 -1.208816
H  -1.735805 -1.150985 1.26238
H  -2.152843 -1.492136 -0.40901
H  1.011819 1.255749 0.499835
H  0.486324 0.09169 1.728825
H  -1.320367 1.445814 1.928576
H  -3.533481 2.918451 -2.22001
H  -2.877157 3.3145 2.00043
H  -0.278426 -2.80865 2.419138
H  3.42679 -2.62586 -0.075775
H  1.210265 -4.758252 -0.910255
elementType: Cl F O N C H
totalener: -2061.43194738 hartree
nucrepener: 2325.33513243 hartree
electener: -4386.76707981 hartree
oneelecener: -7462.12052865 hartree
twoeener: 3075.35344884 hartree
cpcmener: -0.03344599 hartree
kineticenergy: 2055.87673269 hartree
xcener: -143.921108440443 hartree
chargesum: 0.0000000
charge: -0.080279 -0.085664 -0.196201 -0.201039 -0.199070 -0.198716 -0.295248 0.121001 -0.341437 -0.408252 0.152942 -0.089819 -0.105408 -0.005669 -0.013396 -0.169016 0.447571 -0.130604 -0.170064 0.046560 0.098206 0.289377 0.036620 0.074133 0.132886 0.124565 0.145512 0.134019 0.146768 0.125696 0.148511 0.178766 0.121922 0.164825
qa: -0.0803 -0.0857 -0.1962 -0.2010 -0.1991 -0.1987 -0.2952 0.1210 -0.3414 -0.4083 0.1529 -0.0898 -0.1054 -0.0057 -0.0134 -0.1690 0.4476 -0.1306 -0.1701 0.0466 0.0982 0.2894 0.0366 0.0741 0.1329 0.1246 0.1455 0.1340 0.1468 0.1257 0.1485 0.1788 0.1219 0.1648
va: 1.2446 1.2173 1.1083 1.0877 1.0879 1.0858 2.0624 3.3632 2.8630 2.9908 3.6189 3.8880 3.9042 3.5534 4.0050 3.9737 4.3314 4.0545 4.0500 4.0600 3.8530 4.1540 4.0495 1.0670 0.9998 1.0128 1.0019 0.9976 1.0020 1.0200 1.0048 0.9927 0.9842 0.9963
dispcorr: -0.019105438 hartree
energy: -2061.451052817440
dipole: -10.89824 9.03889 -1.85935 -7.31791 8.28105 0.96314 5.23056 -4.19455 1.03601
magnitude: 2.33627 au
magnitude: 5.93832 debye
