program: Orca
programVersion: 4.2.1
elementType: Cl Cl F F F F O N N N C C C C C C C C C C C C C H H H H H H H H H H H
charge: 0
multiplicity: 1
keywords: wb97x-d3
keywords: def2-TZVPP
keywords: def2/J RIJCOSX GRIDX6 NOFINALGRIDX
keywords: grid4 nofinalgrid
keywords: scfconv7
keywords: smallprint printgap noloewdin
keywords: NOSOSCF
formula: C13H11Cl2F4N3O
InChI: InChI=1S/C13H11Cl2F4N3O/c14-9-1-2-10(11(15)3-9)8(4-22-7-20-6-21-22)5-23-13(18,19)12(16)17/h1-3,6-8,12H,4-5H2
34 atoms
Cl -0.91868 1.221816 -2.725848
Cl -4.913061 2.8280 0.434264
F  3.274932 0.826087 -0.411296
F  3.81894 0.519326 1.652373
F  5.705913 -0.304146 -0.094213
F  4.281049 -1.641233 -1.070092
O  2.353967 -0.876469 0.711879
N  -1.000245 -2.34911 0.133749
N  -0.579324 -2.939802 1.257069
N  -2.818066 -3.007956 1.129128
C  0.237281 -0.229846 -0.27259
C  -0.098405 -1.651602 -0.750515
C  1.113701 -0.200079 0.976061
C  -1.026641 0.569892 -0.087311
C  -1.634355 1.242365 -1.147515
C  -1.685143 0.613089 1.140198
C  3.453485 -0.140757 0.5241
C  -2.822508 1.939875 -1.002522
C  -2.872726 1.30176 1.319436
C  -2.33205 -2.385777 0.082622
C  -3.430342 1.963225 0.240178
C  4.601443 -1.057163 0.105922
C  -1.701726 -3.317493 1.812946
H  0.815804 0.219203 -1.082079
H  -0.572281 -1.603765 -1.729769
H  0.805312 -2.246673 -0.867361
H  1.276237 0.83085 1.294259
H  0.670042 -0.732026 1.814411
H  -1.272015 0.096632 1.996473
H  -3.26322 2.452748 -1.845696
H  -3.351763 1.312799 2.287973
H  -2.899843 -1.969988 -0.734593
H  4.810123 -1.823287 0.852215
H  -1.714613 -3.850549 2.75051
elementType: Cl F O N C H
totalener: -2061.43181571 hartree
nucrepener: 2335.67027028 hartree
electener: -4397.10208599 hartree
oneelecener: -7482.79871672 hartree
twoeener: 3085.69663073 hartree
cpcmener: -0.02896567 hartree
kineticenergy: 2055.87698985 hartree
xcener: -143.924359380728 hartree
chargesum: -0.0000000
charge: -0.079500 -0.084547 -0.200380 -0.199887 -0.200163 -0.200699 -0.313831 0.129411 -0.371164 -0.407715 0.099868 -0.095831 -0.060021 -0.022492 -0.002295 -0.172196 0.458696 -0.130621 -0.150431 0.051602 0.098474 0.283739 0.075045 0.080068 0.137134 0.121979 0.147062 0.127167 0.145716 0.125438 0.149202 0.172302 0.125291 0.163578
qa: -0.0795 -0.0845 -0.2004 -0.1999 -0.2002 -0.2007 -0.3138 0.1294 -0.3712 -0.4077 0.0999 -0.0958 -0.0600 -0.0225 -0.0023 -0.1722 0.4587 -0.1306 -0.1504 0.0516 0.0985 0.2837 0.0750 0.0801 0.1371 0.1220 0.1471 0.1272 0.1457 0.1254 0.1492 0.1723 0.1253 0.1636
va: 1.2501 1.2187 1.0960 1.0990 1.0859 1.0823 2.0579 3.3280 2.8680 3.0182 3.7554 3.8449 3.8737 3.5143 3.9896 3.8960 4.3240 4.0730 4.0610 4.0728 3.8632 4.1225 4.0307 1.0592 1.0067 1.0305 1.0088 1.0211 1.0030 1.0199 1.0039 0.9932 0.9844 0.9949
dispcorr: -0.019442004 hartree
energy: -2061.451257717093
dipole: -12.29394 12.23678 -0.05717 -11.56965 11.62513 0.05548 7.39808 -7.32417 0.07391
magnitude: 0.10866 au
magnitude: 0.27620 debye
