program: Orca
programVersion: 4.2.1
elementType: Cl Cl F F F F O N N N C C C C C C C C C C C C C H H H H H H H H H H H
charge: 0
multiplicity: 1
keywords: wb97x-d3
keywords: def2-TZVPP
keywords: def2/J RIJCOSX GRIDX6 NOFINALGRIDX
keywords: grid4 nofinalgrid
keywords: scfconv7
keywords: smallprint printgap noloewdin
keywords: NOSOSCF
formula: C13H11Cl2F4N3O
InChI: InChI=1S/C13H11Cl2F4N3O/c14-9-1-2-10(11(15)3-9)8(4-22-7-20-6-21-22)5-23-13(18,19)12(16)17/h1-3,6-8,12H,4-5H2
34 atoms
Cl -1.573045 0.373093 -2.817469
Cl -1.42225 4.935251 -0.040263
F  3.26494 -0.908336 -0.733269
F  2.005553 0.841764 -0.706299
F  2.30523 1.07073 1.999799
F  4.190318 1.016329 0.898466
O  1.36106 -0.976905 0.425543
N  -1.413245 -3.177247 1.021777
N  -2.287753 -3.822273 0.246757
N  -0.829992 -5.266535 1.155902
C  -0.965166 -1.080488 -0.179512
C  -1.409469 -1.737546 1.130572
C  0.455209 -1.46734 -0.573289
C  -1.109296 0.420138 -0.137826
C  -1.369255 1.164642 -1.287683
C  -0.929394 1.137633 1.041619
C  2.391164 -0.217626 0.044969
C  -1.469915 2.546306 -1.275094
C  -1.021888 2.518259 1.090522
C  -0.548685 -4.0462 1.544007
C  -1.294797 3.211559 -0.074482
C  3.131224 0.271719 1.288538
C  -1.899334 -5.065628 0.365535
H  -1.613341 -1.475276 -0.965792
H  -0.756675 -1.491246 1.96582
H  -2.413444 -1.405947 1.392165
H  0.571722 -2.551116 -0.625092
H  0.686191 -1.076654 -1.564826
H  -0.71902 0.618891 1.96578
H  -1.680238 3.089728 -2.185395
H  -0.879685 3.038414 2.02708
H  0.251946 -3.750737 2.203761
H  3.473651 -0.552679 1.913619
H  -2.415101 -5.86647 -0.140363
elementType: Cl F O N C H
totalener: -2061.43303979 hartree
nucrepener: 2379.57217157 hartree
electener: -4441.00521136 hartree
oneelecener: -7570.58349003 hartree
twoeener: 3129.57827867 hartree
cpcmener: -0.03165757 hartree
kineticenergy: 2055.88223361 hartree
xcener: -143.924484951189 hartree
chargesum: -0.0000000
charge: -0.083967 -0.088236 -0.201241 -0.195697 -0.196592 -0.201036 -0.304629 0.097172 -0.355153 -0.416233 0.168774 -0.139518 -0.082211 0.024991 -0.032995 -0.190821 0.465047 -0.129720 -0.164208 0.063908 0.099767 0.286582 0.073148 0.094461 0.121472 0.148315 0.138272 0.127499 0.136408 0.124795 0.146514 0.178401 0.123820 0.162913
qa: -0.0840 -0.0882 -0.2012 -0.1957 -0.1966 -0.2010 -0.3046 0.0972 -0.3552 -0.4162 0.1688 -0.1395 -0.0822 0.0250 -0.0330 -0.1908 0.4650 -0.1297 -0.1642 0.0639 0.0998 0.2866 0.0731 0.0945 0.1215 0.1483 0.1383 0.1275 0.1364 0.1248 0.1465 0.1784 0.1238 0.1629
va: 1.2448 1.2151 1.0986 1.0976 1.0849 1.0848 2.0514 3.3604 2.8787 3.0197 3.6078 3.9245 3.8982 3.4736 3.9972 3.9554 4.3059 4.0675 4.0611 4.0537 3.8513 4.1220 4.0384 1.0525 1.0033 1.0020 1.0018 1.0177 1.0104 1.0198 1.0045 0.9924 0.9852 0.9948
dispcorr: -0.019328663 hartree
energy: -2061.452368457518
dipole: -12.01462 11.99641 -0.01821 -19.79014 19.67728 -0.11286 8.02499 -6.78773 1.23726
magnitude: 1.24253 au
magnitude: 3.15826 debye
