program: Orca
programVersion: 4.2.1
elementType: Cl Cl F F F F O N N N C C C C C C C C C C C C C H H H H H H H H H H H
charge: 0
multiplicity: 1
keywords: wb97x-d3
keywords: def2-TZVPP
keywords: def2/J RIJCOSX GRIDX6 NOFINALGRIDX
keywords: grid4 nofinalgrid
keywords: scfconv7
keywords: smallprint printgap noloewdin
keywords: NOSOSCF
formula: C13H11Cl2F4N3O
InChI: InChI=1S/C13H11Cl2F4N3O/c14-9-1-2-10(11(15)3-9)8(4-22-7-20-6-21-22)5-23-13(18,19)12(16)17/h1-3,6-8,12H,4-5H2
34 atoms
Cl -1.031812 0.960444 -2.882102
Cl -5.107116 2.558528 0.178473
F  3.291727 0.948855 -0.702106
F  3.929627 0.979717 1.358516
F  4.27995 -1.580652 -1.010762
F  4.910595 -1.600589 1.080497
O  2.436099 -0.549365 0.724759
N  -0.806239 -2.216348 0.307501
N  -0.382383 -2.598432 1.516132
N  -2.59996 -2.892314 1.334972
C  0.297532 -0.077152 -0.313186
C  0.06157 -1.560794 -0.639999
C  1.19011 0.140611 0.905714
C  -1.023982 0.63702 -0.180876
C  -1.714869 1.11245 -1.295791
C  -1.658864 0.776797 1.051991
C  3.516853 0.145972 0.369376
C  -2.963024 1.706568 -1.201858
C  -2.905504 1.365302 1.18106
C  -2.126273 -2.382519 0.224193
C  -3.547863 1.826714 0.046451
C  4.665335 -0.798188 0.021787
C  -1.490022 -2.996781 2.087682
H  0.82607 0.330554 -1.176846
H  -0.40594 -1.646408 -1.619612
H  1.003577 -2.103475 -0.691916
H  1.339117 1.208291 1.074526
H  0.766667 -0.27824 1.814459
H  -1.182774 0.416214 1.953979
H  -3.467756 2.064502 -2.088154
H  -3.364004 1.453077 2.155723
H  -2.693459 -2.139339 -0.660639
H  5.572694 -0.25713 -0.246824
H  -1.49473 -3.38855 3.09269
elementType: Cl F O N C H
totalener: -2061.43092322 hartree
nucrepener: 2346.79405257 hartree
electener: -4408.22497579 hartree
oneelecener: -7505.32538806 hartree
twoeener: 3097.10041227 hartree
cpcmener: -0.02922635 hartree
kineticenergy: 2055.88243298 hartree
xcener: -143.925465321389 hartree
chargesum: -0.0000000
charge: -0.079783 -0.084517 -0.202668 -0.199716 -0.201148 -0.199909 -0.306437 0.133100 -0.370109 -0.406316 0.096024 -0.101694 -0.051229 -0.029094 0.000570 -0.166666 0.449311 -0.131103 -0.156662 0.052582 0.101855 0.283480 0.073459 0.082219 0.137241 0.121510 0.147423 0.123891 0.144621 0.126054 0.149131 0.169764 0.131710 0.163105
qa: -0.0798 -0.0845 -0.2027 -0.1997 -0.2011 -0.1999 -0.3064 0.1331 -0.3701 -0.4063 0.0960 -0.1017 -0.0512 -0.0291 0.0006 -0.1667 0.4493 -0.1311 -0.1567 0.0526 0.1019 0.2835 0.0735 0.0822 0.1372 0.1215 0.1474 0.1239 0.1446 0.1261 0.1491 0.1698 0.1317 0.1631
va: 1.2496 1.2187 1.0939 1.0998 1.0874 1.0863 2.0701 3.3219 2.8626 3.0176 3.7563 3.8416 3.8648 3.5317 3.9869 3.8972 4.3399 4.0731 4.0674 4.0710 3.8608 4.1326 4.0297 1.0568 1.0066 1.0343 1.0079 1.0236 1.0043 1.0199 1.0039 0.9947 0.9821 0.9951
dispcorr: -0.019668755 hartree
energy: -2061.450591974697
dipole: -9.69476 10.20580 0.51104 -7.45744 8.48835 1.03091 6.32039 -7.06821 -0.74782
magnitude: 1.37228 au
magnitude: 3.48807 debye
