program: Orca
programVersion: 4.2.1
elementType: Cl Cl F F F F O N N N C C C C C C C C C C C C C H H H H H H H H H H H
charge: 0
multiplicity: 1
keywords: wb97x-d3
keywords: def2-TZVPP
keywords: def2/J RIJCOSX GRIDX6 NOFINALGRIDX
keywords: grid4 nofinalgrid
keywords: scfconv7
keywords: smallprint printgap noloewdin
keywords: NOSOSCF
formula: C13H11Cl2F4N3O
InChI: InChI=1S/C13H11Cl2F4N3O/c14-9-1-2-10(11(15)3-9)8(4-22-7-20-6-21-22)5-23-13(18,19)12(16)17/h1-3,6-8,12H,4-5H2
34 atoms
Cl -0.439903 0.463238 -2.632044
Cl -1.505002 4.820631 0.259972
F  1.713989 0.868005 1.278904
F  3.099615 -0.779736 1.392325
F  4.131564 1.39289 0.178851
F  2.508702 1.414015 -1.282441
O  1.474443 -0.850535 -0.135079
N  -1.919261 -3.338404 0.556152
N  -2.036499 -3.956531 -0.620673
N  -1.493306 -5.425081 0.987534
C  -0.899657 -1.171818 -0.027269
C  -2.044069 -1.903903 0.677688
C  0.446246 -1.533992 0.594909
C  -1.098238 0.322065 0.008009
C  -0.877889 1.138358 -1.09869
C  -1.441672 0.957255 1.199232
C  2.333446 -0.069369 0.522148
C  -0.999537 2.518712 -1.03496
C  -1.575237 2.330309 1.296571
C  -1.586886 -4.220916 1.497242
C  -1.349846 3.100953 0.168993
C  3.252518 0.611972 -0.490272
C  -1.777405 -5.199793 -0.307465
H  -0.89413 -1.511282 -1.06422
H  -2.077484 -1.682937 1.743624
H  -2.997939 -1.598414 0.250508
H  0.459168 -1.28102 1.657614
H  0.648165 -2.601868 0.504927
H  -1.600562 0.370634 2.09488
H  -0.822716 3.125072 -1.912175
H  -1.844246 2.786301 2.238754
H  -1.434161 -3.946057 2.529194
H  3.796191 -0.107949 -1.102003
H  -1.797142 -5.981999 -1.049782
elementType: Cl F O N C H
totalener: -2061.43078786 hartree
nucrepener: 2390.83281389 hartree
electener: -4452.26360175 hartree
oneelecener: -7593.63153508 hartree
twoeener: 3141.36793333 hartree
cpcmener: -0.03510205 hartree
kineticenergy: 2055.88914131 hartree
xcener: -143.924550447190 hartree
chargesum: 0.0000000
charge: -0.086078 -0.089222 -0.194997 -0.202658 -0.201873 -0.192199 -0.308212 0.088062 -0.353943 -0.415829 0.176905 -0.120488 -0.074251 -0.016543 -0.009832 -0.159451 0.467786 -0.143781 -0.175002 0.068353 0.107506 0.278738 0.072972 0.079563 0.128057 0.136869 0.127435 0.133550 0.143438 0.121766 0.148020 0.179063 0.123386 0.162890
qa: -0.0861 -0.0892 -0.1950 -0.2027 -0.2019 -0.1922 -0.3082 0.0881 -0.3539 -0.4158 0.1769 -0.1205 -0.0743 -0.0165 -0.0098 -0.1595 0.4678 -0.1438 -0.1750 0.0684 0.1075 0.2787 0.0730 0.0796 0.1281 0.1369 0.1274 0.1336 0.1434 0.1218 0.1480 0.1791 0.1234 0.1629
va: 1.2348 1.2145 1.0974 1.0959 1.0836 1.0895 2.0660 3.3676 2.8749 3.0207 3.5784 3.9330 3.9139 3.5119 3.9539 3.9451 4.3142 4.0803 4.0557 4.0535 3.8405 4.1230 4.0383 1.0728 0.9978 1.0034 0.9996 1.0063 1.0045 1.0215 1.0041 0.9912 0.9846 0.9948
dispcorr: -0.019340917 hartree
energy: -2061.450128779049
dipole: -16.00053 15.34801 -0.65252 -21.52408 21.27381 -0.25026 7.27752 -6.08274 1.19478
magnitude: 1.38416 au
magnitude: 3.51826 debye
