program: Orca
programVersion: 4.2.1
elementType: Cl Cl F F F F O N N N C C C C C C C C C C C C C H H H H H H H H H H H
charge: 0
multiplicity: 1
keywords: wb97x-d3
keywords: def2-TZVPP
keywords: def2/J RIJCOSX GRIDX6 NOFINALGRIDX
keywords: grid4 nofinalgrid
keywords: scfconv7
keywords: smallprint printgap noloewdin
keywords: NOSOSCF
formula: C13H11Cl2F4N3O
InChI: InChI=1S/C13H11Cl2F4N3O/c14-9-1-2-10(11(15)3-9)8(4-22-7-20-6-21-22)5-23-13(18,19)12(16)17/h1-3,6-8,12H,4-5H2
34 atoms
Cl -1.830546 0.302263 -2.889606
Cl -3.206253 3.607247 1.075738
F  3.749914 -1.437034 -0.067973
F  4.050197 0.301168 -1.312642
F  3.29986 0.133814 2.109919
F  3.536251 1.929991 0.886725
O  2.071634 0.01151 -0.325736
N  -1.05848 -2.680584 0.662591
N  -1.966357 -3.221819 -0.149359
N  -2.775481 -3.063027 1.937807
C  0.029557 -1.099938 -0.875428
C  0.210491 -2.204203 0.165854
C  1.380511 -0.640489 -1.400819
C  -0.793134 0.066899 -0.386074
C  -1.66007 0.762316 -1.226844
C  -0.687993 0.53127 0.923339
C  3.388966 -0.135391 -0.211661
C  -2.406366 1.848471 -0.794878
C  -1.419073 1.610206 1.388465
C  -1.556264 -2.583506 1.893376
C  -2.27877 2.259106 0.519548
C  3.899435 0.633541 1.005443
C  -2.970055 -3.43553 0.661824
H  -0.470595 -1.555744 -1.732036
H  0.745708 -3.038011 -0.288941
H  0.795505 -1.883023 1.026013
H  1.938185 -1.498057 -1.782475
H  1.251612 0.068945 -2.219138
H  -0.010292 0.051759 1.615903
H  -3.071561 2.362047 -1.474642
H  -1.31163 1.936684 2.413002
H  -0.998771 -2.178382 2.722771
H  4.983011 0.564393 1.111127
H  -3.887293 -3.884694 0.315206
elementType: Cl F O N C H
totalener: -2061.43250176 hartree
nucrepener: 2364.24562745 hartree
electener: -4425.67812921 hartree
oneelecener: -7540.34666470 hartree
twoeener: 3114.66853549 hartree
cpcmener: -0.03159764 hartree
kineticenergy: 2055.90250907 hartree
xcener: -143.927856192444 hartree
chargesum: 0.0000000
charge: -0.082503 -0.086723 -0.205453 -0.199644 -0.202487 -0.202298 -0.287044 0.118968 -0.356438 -0.418992 0.120200 -0.176081 -0.033542 0.084080 -0.028354 -0.230666 0.435667 -0.123986 -0.151903 0.076783 0.088920 0.286626 0.067450 0.094593 0.137152 0.121745 0.131584 0.124416 0.145366 0.125144 0.147812 0.175682 0.140479 0.163445
qa: -0.0825 -0.0867 -0.2055 -0.1996 -0.2025 -0.2023 -0.2870 0.1190 -0.3564 -0.4190 0.1202 -0.1761 -0.0335 0.0841 -0.0284 -0.2307 0.4357 -0.1240 -0.1519 0.0768 0.0889 0.2866 0.0675 0.0946 0.1372 0.1217 0.1316 0.1244 0.1454 0.1251 0.1478 0.1757 0.1405 0.1634
va: 1.2432 1.2168 1.0890 1.1018 1.0848 1.0850 2.0898 3.3671 2.8776 3.0258 3.6905 3.9217 3.8852 3.4416 4.0018 3.9542 4.3574 4.0442 4.0676 4.0444 3.8685 4.1158 4.0452 1.0525 1.0041 1.0127 1.0029 1.0101 1.0065 1.0199 1.0044 0.9927 0.9824 0.9943
dispcorr: -0.019135367 hartree
energy: -2061.451637132162
dipole: -6.76063 8.88684 2.12621 -14.57658 14.34424 -0.23233 2.36419 -2.52140 -0.15722
magnitude: 2.14464 au
magnitude: 5.45123 debye
