program: Orca
programVersion: 4.2.1
elementType: Cl Cl F F F F O N N N C C C C C C C C C C C C C H H H H H H H H H H H
charge: 0
multiplicity: 1
keywords: wb97x-d3
keywords: def2-TZVPP
keywords: def2/J RIJCOSX GRIDX6 NOFINALGRIDX
keywords: grid4 nofinalgrid
keywords: scfconv7
keywords: smallprint printgap noloewdin
keywords: NOSOSCF
formula: C13H11Cl2F4N3O
InChI: InChI=1S/C13H11Cl2F4N3O/c14-9-1-2-10(11(15)3-9)8(4-22-7-20-6-21-22)5-23-13(18,19)12(16)17/h1-3,6-8,12H,4-5H2
34 atoms
Cl -1.437612 0.036176 -2.328833
Cl -2.94483 3.435513 1.501739
F  3.621256 0.391326 1.225054
F  4.323084 -0.864204 -0.381192
F  5.069722 1.717163 -0.640615
F  2.988958 2.373684 -0.568327
O  2.180016 -0.226848 -0.368104
N  -1.828973 -2.860239 0.189565
N  -2.795362 -2.636527 1.083591
N  -3.677713 -3.094758 -0.928196
C  0.176539 -1.46444 -0.118905
C  -0.428783 -2.720046 0.515143
C  1.637607 -1.37659 0.288998
C  -0.60397 -0.228847 0.253629
C  -1.356175 0.502731 -0.660204
C  -0.619639 0.210201 1.575399
C  3.438553 0.124497 -0.092861
C  -2.079434 1.62864 -0.291381
C  -1.328716 1.326672 1.977953
C  -2.369391 -3.119435 -1.000333
C  -2.053663 2.03091 1.030621
C  3.799185 1.354031 -0.925659
C  -3.878185 -2.793183 0.367027
H  0.155969 -1.599819 -1.201438
H  0.104879 -3.604382 0.167233
H  -0.350842 -2.697075 1.600488
H  1.742394 -1.291705 1.372829
H  2.158763 -2.28061 -0.033089
H  -0.062535 -0.336184 2.326404
H  -2.650133 2.178627 -1.026431
H  -1.315143 1.638125 3.012781
H  -1.780746 -3.337857 -1.876953
H  3.703883 1.164513 -1.994997
H  -4.859521 -2.689998 0.802627
elementType: Cl F O N C H
totalener: -2061.43263011 hartree
nucrepener: 2355.45721989 hartree
electener: -4416.88985001 hartree
oneelecener: -7522.87784070 hartree
twoeener: 3105.98799069 hartree
cpcmener: -0.03732155 hartree
kineticenergy: 2055.88586346 hartree
xcener: -143.923524729349 hartree
chargesum: -0.0000000
charge: -0.085286 -0.087511 -0.200717 -0.201135 -0.201247 -0.198793 -0.281684 0.119431 -0.345932 -0.409256 0.079805 -0.111162 -0.077762 0.050418 -0.019102 -0.180532 0.448104 -0.115514 -0.154718 0.041611 0.091030 0.286445 0.056610 0.085328 0.142942 0.124834 0.126751 0.135132 0.140794 0.124462 0.148545 0.181877 0.122720 0.163513
qa: -0.0853 -0.0875 -0.2007 -0.2011 -0.2012 -0.1988 -0.2817 0.1194 -0.3459 -0.4093 0.0798 -0.1112 -0.0778 0.0504 -0.0191 -0.1805 0.4481 -0.1155 -0.1547 0.0416 0.0910 0.2864 0.0566 0.0853 0.1429 0.1248 0.1268 0.1351 0.1408 0.1245 0.1485 0.1819 0.1227 0.1635
va: 1.2354 1.2159 1.0970 1.0967 1.0846 1.0847 2.0787 3.3700 2.8785 3.0230 3.8213 3.8930 3.9490 3.4084 3.9660 3.9681 4.3386 4.0439 4.0299 4.0590 3.8579 4.1238 4.0500 1.0456 0.9998 1.0084 0.9971 1.0040 1.0063 1.0192 1.0028 0.9929 0.9848 0.9952
dispcorr: -0.018905566 hartree
energy: -2061.451535678932
dipole: -11.87433 13.26628 1.39195 -20.12983 18.59396 -1.53586 4.38976 -4.52377 -0.13401
magnitude: 2.07711 au
magnitude: 5.27959 debye
