program: Orca
programVersion: 4.2.1
elementType: Cl Cl F F F F O N N N C C C C C C C C C C C C C H H H H H H H H H H H
charge: 0
multiplicity: 1
keywords: wb97x-d3
keywords: def2-TZVPP
keywords: def2/J RIJCOSX GRIDX6 NOFINALGRIDX
keywords: grid4 nofinalgrid
keywords: scfconv7
keywords: smallprint printgap noloewdin
keywords: NOSOSCF
formula: C13H11Cl2F4N3O
InChI: InChI=1S/C13H11Cl2F4N3O/c14-9-1-2-10(11(15)3-9)8(4-22-7-20-6-21-22)5-23-13(18,19)12(16)17/h1-3,6-8,12H,4-5H2
34 atoms
Cl -2.134621 -0.397118 -2.138262
Cl -4.841654 3.204021 0.725616
F  4.143445 1.456361 0.565223
F  3.496956 -0.331534 1.586214
F  4.376982 -1.877112 -0.500541
F  5.904604 -0.587825 0.380739
O  2.582876 0.173529 -0.387788
N  -0.818377 -2.138499 0.487134
N  -2.046324 -1.999237 0.992144
N  -1.987895 -3.699309 -0.472444
C  0.208235 0.01954 -0.144226
C  0.247119 -1.20821 0.774235
C  1.433135 0.898017 0.080546
C  -1.059452 0.813208 0.050321
C  -2.160082 0.696947 -0.795743
C  -1.188739 1.68371 1.130586
C  3.696425 0.194661 0.349942
C  -3.323897 1.425156 -0.60263
C  -2.336478 2.42393 1.354169
C  -0.80521 -3.14162 -0.390294
C  -3.396818 2.289174 0.475055
C  4.784592 -0.594372 -0.375714
C  -2.705026 -2.953543 0.387916
H  0.255047 -0.329572 -1.178275
H  1.184783 -1.747324 0.64698
H  0.174223 -0.916986 1.821607
H  1.350207 1.816269 -0.501201
H  1.543296 1.171445 1.131166
H  -0.374479 1.79402 1.834984
H  -4.158597 1.314521 -1.280519
H  -2.396799 3.09141 2.201926
H  0.081998 -3.436352 -0.928684
H  5.003656 -0.179775 -1.359669
H  -3.751176 -3.126444 0.586476
elementType: Cl F O N C H
totalener: -2061.43199480 hartree
nucrepener: 2325.93782064 hartree
electener: -4387.36981544 hartree
oneelecener: -7463.49295439 hartree
twoeener: 3076.12313895 hartree
cpcmener: -0.03314440 hartree
kineticenergy: 2055.87686955 hartree
xcener: -143.922888127763 hartree
chargesum: -0.0000000
charge: -0.084020 -0.087233 -0.199147 -0.203342 -0.200264 -0.199898 -0.318693 0.101727 -0.342951 -0.406973 0.153539 -0.113103 -0.075682 0.018646 -0.024424 -0.167378 0.469067 -0.118196 -0.171888 0.057111 0.096230 0.284564 0.057816 0.087364 0.118717 0.130077 0.137858 0.120692 0.145964 0.124650 0.147279 0.175850 0.125581 0.160463
qa: -0.0840 -0.0872 -0.1991 -0.2033 -0.2003 -0.1999 -0.3187 0.1017 -0.3430 -0.4070 0.1535 -0.1131 -0.0757 0.0186 -0.0244 -0.1674 0.4691 -0.1182 -0.1719 0.0571 0.0962 0.2846 0.0578 0.0874 0.1187 0.1301 0.1379 0.1207 0.1460 0.1246 0.1473 0.1758 0.1256 0.1605
va: 1.2412 1.2163 1.1023 1.0894 1.0821 1.0865 2.0640 3.3733 2.8689 3.0160 3.6204 3.8917 3.9316 3.4669 3.9809 3.9917 4.2887 4.0416 4.0421 4.0608 3.8568 4.1330 4.0485 1.0529 1.0251 1.0046 1.0031 1.0093 1.0001 1.0196 1.0053 0.9933 0.9843 0.9965
dispcorr: -0.019083679 hartree
energy: -2061.451078476081
dipole: -8.10248 9.46139 1.35891 -3.05027 4.55877 1.50849 2.51737 -2.71099 -0.19362
magnitude: 2.03953 au
magnitude: 5.18407 debye
