program: Orca
programVersion: 4.2.1
elementType: Cl Cl F F F F O N N N C C C C C C C C C C C C C H H H H H H H H H H H
charge: 0
multiplicity: 1
keywords: wb97x-d3
keywords: def2-TZVPP
keywords: def2/J RIJCOSX GRIDX6 NOFINALGRIDX
keywords: grid4 nofinalgrid
keywords: scfconv7
keywords: smallprint printgap noloewdin
keywords: NOSOSCF
formula: C13H11Cl2F4N3O
InChI: InChI=1S/C13H11Cl2F4N3O/c14-9-1-2-10(11(15)3-9)8(4-22-7-20-6-21-22)5-23-13(18,19)12(16)17/h1-3,6-8,12H,4-5H2
34 atoms
Cl -2.624311 0.414211 -2.733207
Cl -2.565341 5.036467 -0.066491
F  2.837644 -2.084824 0.481621
F  3.508096 -0.601434 -0.935003
F  2.75562 -0.124701 2.459047
F  3.565658 1.302059 1.016724
O  1.540723 -0.310714 0.079611
N  -0.655357 -2.820563 0.730886
N  -1.116241 -3.656706 -0.20302
N  0.384675 -4.690872 1.106436
C  -0.744914 -0.70184 -0.527508
C  -1.063653 -1.436595 0.778663
C  0.706934 -0.839414 -0.959152
C  -1.193574 0.737139 -0.43402
C  -2.045381 1.319685 -1.372087
C  -0.771318 1.55183 0.617299
C  2.790026 -0.753903 0.205029
C  -2.473154 2.635604 -1.272704
C  -1.175868 2.869215 0.74195
C  0.240641 -3.446317 1.492591
C  -2.031846 3.399181 -0.207979
C  3.498686 -0.009594 1.33532
C  -0.46453 -4.758793 0.06556
H  -1.313048 -1.19585 -1.317054
H  -0.565406 -0.990488 1.637145
H  -2.135407 -1.386565 0.968449
H  0.935754 -1.88836 -1.157228
H  0.874922 -0.282349 -1.882254
H  -0.10572 1.157811 1.372663
H  -3.139724 3.052244 -2.014619
H  -0.826115 3.46751 1.571313
H  0.740939 -2.969931 2.32066
H  4.502288 -0.395625 1.51695
H  -0.613893 -5.655709 -0.514768
elementType: Cl F O N C H
totalener: -2061.43198365 hartree
nucrepener: 2351.13490783 hartree
electener: -4412.56689148 hartree
oneelecener: -7513.84239065 hartree
twoeener: 3101.27549916 hartree
cpcmener: -0.02822753 hartree
kineticenergy: 2055.87695898 hartree
xcener: -143.922590676484 hartree
chargesum: 0.0000000
charge: -0.082385 -0.086126 -0.200784 -0.198597 -0.202855 -0.202389 -0.289294 0.107453 -0.365392 -0.415203 0.134338 -0.128493 -0.033948 -0.017616 -0.008132 -0.161151 0.435546 -0.131966 -0.177626 0.073031 0.098623 0.286623 0.072468 0.089903 0.127193 0.135973 0.126518 0.134191 0.132273 0.124762 0.147463 0.168565 0.144117 0.162917
qa: -0.0824 -0.0861 -0.2008 -0.1986 -0.2029 -0.2024 -0.2893 0.1075 -0.3654 -0.4152 0.1343 -0.1285 -0.0339 -0.0176 -0.0081 -0.1612 0.4355 -0.1320 -0.1776 0.0730 0.0986 0.2866 0.0725 0.0899 0.1272 0.1360 0.1265 0.1342 0.1323 0.1248 0.1475 0.1686 0.1441 0.1629
va: 1.2417 1.2174 1.0905 1.1039 1.0846 1.0854 2.0829 3.3402 2.8592 3.0220 3.6389 3.9324 3.8818 3.5435 3.9932 3.9759 4.3526 4.0483 4.0584 4.0453 3.8505 4.1096 4.0354 1.0693 0.9975 1.0043 1.0013 1.0072 1.0242 1.0199 1.0049 1.0020 0.9824 0.9949
dispcorr: -0.019022476 hartree
energy: -2061.451006128251
dipole: -6.33594 6.62091 0.28497 -12.66326 13.40093 0.73767 3.41631 -2.82275 0.59355
magnitude: 0.98877 au
magnitude: 2.51326 debye
