program: Orca
programVersion: 4.2.1
elementType: Cl Cl F F F F O N N N C C C C C C C C C C C C C H H H H H H H H H H H
charge: 0
multiplicity: 1
keywords: wb97x-d3
keywords: def2-TZVPP
keywords: def2/J RIJCOSX GRIDX6 NOFINALGRIDX
keywords: grid4 nofinalgrid
keywords: scfconv7
keywords: smallprint printgap noloewdin
keywords: NOSOSCF
formula: C13H11Cl2F4N3O
InChI: InChI=1S/C13H11Cl2F4N3O/c14-9-1-2-10(11(15)3-9)8(4-22-7-20-6-21-22)5-23-13(18,19)12(16)17/h1-3,6-8,12H,4-5H2
34 atoms
Cl -1.072045 0.741973 -2.805387
Cl -3.575234 3.165395 1.246267
F  4.251748 -1.099193 0.513649
F  3.381769 -0.192367 -1.238857
F  3.176465 2.208195 0.072157
F  5.19607 1.376285 0.018868
O  2.181779 -0.274346 0.647281
N  -1.549109 -2.576732 -0.133489
N  -1.2557 -3.112771 1.053951
N  -3.420653 -2.527607 0.971703
C  0.305301 -1.021883 -0.705185
C  -0.532055 -2.25213 -1.102869
C  1.401518 -1.420498 0.272849
C  -0.599715 0.078849 -0.210568
C  -1.302247 0.897851 -1.092814
C  -0.857405 0.26038 1.146521
C  3.396367 -0.121619 0.11627
C  -2.214094 1.850119 -0.664376
C  -1.762352 1.199994 1.609001
C  -2.831865 -2.216718 -0.157252
C  -2.436006 1.989153 0.693656
C  3.965519 1.22444 0.558884
C  -2.406506 -3.062604 1.674235
H  0.795952 -0.699352 -1.625611
H  -1.039072 -2.064239 -2.04716
H  0.107556 -3.120895 -1.254059
H  1.007234 -1.835529 1.198309
H  2.01761 -2.1981 -0.182138
H  -0.351608 -0.348554 1.882964
H  -2.741892 2.465356 -1.379402
H  -1.935578 1.307862 2.670372
H  -3.295592 -1.755955 -1.015621
H  4.028965 1.307128 1.643911
H  -2.521163 -3.442867 2.67721
elementType: Cl F O N C H
totalener: -2061.43106607 hartree
nucrepener: 2378.14023628 hartree
electener: -4439.57130235 hartree
oneelecener: -7568.18158892 hartree
twoeener: 3128.61028657 hartree
cpcmener: -0.03044099 hartree
kineticenergy: 2055.88476784 hartree
xcener: -143.925839324293 hartree
chargesum: -0.0000000
charge: -0.079767 -0.086125 -0.201166 -0.200805 -0.200250 -0.200962 -0.310492 0.137607 -0.370293 -0.403076 0.075817 -0.141987 -0.029923 0.043099 -0.030103 -0.171473 0.456661 -0.108974 -0.168296 0.063210 0.096148 0.283108 0.070581 0.082952 0.137412 0.133622 0.122695 0.128958 0.143430 0.125911 0.147034 0.170229 0.123645 0.161574
qa: -0.0798 -0.0861 -0.2012 -0.2008 -0.2003 -0.2010 -0.3105 0.1376 -0.3703 -0.4031 0.0758 -0.1420 -0.0299 0.0431 -0.0301 -0.1715 0.4567 -0.1090 -0.1683 0.0632 0.0961 0.2831 0.0706 0.0830 0.1374 0.1336 0.1227 0.1290 0.1434 0.1259 0.1470 0.1702 0.1236 0.1616
va: 1.2500 1.2169 1.0961 1.0964 1.0834 1.0843 2.0669 3.3066 2.8529 3.0218 3.7706 3.9127 3.8602 3.4553 3.9744 3.9121 4.3365 4.0469 4.0773 4.0602 3.8607 4.1240 4.0366 1.0517 1.0033 1.0087 1.0251 1.0097 1.0031 1.0194 1.0043 0.9947 0.9845 0.9957
dispcorr: -0.020040826 hartree
energy: -2061.451106897417
dipole: -12.41260 12.70310 0.29050 -17.38455 16.59957 -0.78498 5.13353 -5.29678 -0.16325
magnitude: 0.85278 au
magnitude: 2.16759 debye
