program: Orca
programVersion: 4.2.1
elementType: Cl Cl F F F F O N N N C C C C C C C C C C C C C H H H H H H H H H H H
charge: 0
multiplicity: 1
keywords: wb97x-d3
keywords: def2-TZVPP
keywords: def2/J RIJCOSX GRIDX6 NOFINALGRIDX
keywords: grid4 nofinalgrid
keywords: scfconv7
keywords: smallprint printgap noloewdin
keywords: NOSOSCF
formula: C13H11Cl2F4N3O
InChI: InChI=1S/C13H11Cl2F4N3O/c14-9-1-2-10(11(15)3-9)8(4-22-7-20-6-21-22)5-23-13(18,19)12(16)17/h1-3,6-8,12H,4-5H2
34 atoms
Cl -1.673381 -0.227545 -2.871134
Cl -2.727848 3.704313 0.583673
F  4.115481 0.044562 -1.113735
F  2.493796 1.393281 -0.663025
F  2.891488 1.017256 2.028058
F  4.654578 1.708628 0.940592
O  2.344218 -0.734839 -0.001731
N  -1.321443 -2.773488 0.782204
N  -2.072435 -3.509552 -0.03963
N  -3.302139 -2.747057 1.676468
C  0.141404 -1.452485 -0.681888
C  0.051457 -2.455734 0.469525
C  1.584443 -1.239505 -1.111275
C  -0.569648 -0.155638 -0.381946
C  -1.415592 0.462735 -1.301482
C  -0.399415 0.489908 0.842076
C  3.154277 0.308021 -0.190875
C  -2.081385 1.647202 -1.021914
C  -1.048238 1.67144 1.153555
C  -2.068419 -2.318308 1.787046
C  -1.892167 2.238387 0.213878
C  3.83629 0.650285 1.133246
C  -3.242573 -3.467596 0.542045
H  -0.330149 -1.929752 -1.543175
H  0.563617 -3.376074 0.191022
H  0.51814 -2.094495 1.383819
H  2.025376 -2.19067 -1.413287
H  1.620009 -0.568366 -1.970576
H  0.251564 0.062229 1.591717
H  -2.7362 2.095787 -1.756051
H  -0.896928 2.137669 2.116912
H  -1.673407 -1.70022 2.577805
H  4.408675 -0.189341 1.527785
H  -4.09373 -3.987679 0.131677
elementType: Cl F O N C H
totalener: -2061.43335742 hartree
nucrepener: 2382.03239243 hartree
electener: -4443.46574985 hartree
oneelecener: -7575.77791276 hartree
twoeener: 3132.31216291 hartree
cpcmener: -0.03366478 hartree
kineticenergy: 2055.88286998 hartree
xcener: -143.924036430888 hartree
chargesum: 0.0000000
charge: -0.081233 -0.085925 -0.200949 -0.199504 -0.198507 -0.200468 -0.314903 0.111037 -0.347542 -0.417905 0.109289 -0.132465 -0.027785 0.097549 -0.027293 -0.292780 0.468879 -0.121039 -0.127768 0.075896 0.081340 0.284146 0.062715 0.090166 0.131183 0.133924 0.130666 0.119968 0.146562 0.124398 0.147969 0.173793 0.123964 0.162621
qa: -0.0812 -0.0859 -0.2009 -0.1995 -0.1985 -0.2005 -0.3149 0.1110 -0.3475 -0.4179 0.1093 -0.1325 -0.0278 0.0975 -0.0273 -0.2928 0.4689 -0.1210 -0.1278 0.0759 0.0813 0.2841 0.0627 0.0902 0.1312 0.1339 0.1307 0.1200 0.1466 0.1244 0.1480 0.1738 0.1240 0.1626
va: 1.2432 1.2176 1.1002 1.0941 1.0827 1.0856 2.0660 3.3708 2.8851 3.0242 3.7142 3.9004 3.9186 3.3894 4.0066 3.9835 4.3088 4.0383 4.0269 4.0527 3.8757 4.1209 4.0507 1.0580 1.0095 1.0003 1.0008 1.0093 1.0146 1.0197 1.0026 0.9928 0.9851 0.9947
dispcorr: -0.019747543 hartree
energy: -2061.453104960306
dipole: -7.62590 9.48830 1.86240 -19.69360 18.58832 -1.10528 4.68717 -4.29233 0.39484
magnitude: 2.20138 au
magnitude: 5.59546 debye
