program: Orca
programVersion: 4.2.1
elementType: Cl Cl F F F F O N N N C C C C C C C C C C C C C H H H H H H H H H H H
charge: 0
multiplicity: 1
keywords: wb97x-d3
keywords: def2-TZVPP
keywords: def2/J RIJCOSX GRIDX6 NOFINALGRIDX
keywords: grid4 nofinalgrid
keywords: scfconv7
keywords: smallprint printgap noloewdin
keywords: NOSOSCF
formula: C13H11Cl2F4N3O
InChI: InChI=1S/C13H11Cl2F4N3O/c14-9-1-2-10(11(15)3-9)8(4-22-7-20-6-21-22)5-23-13(18,19)12(16)17/h1-3,6-8,12H,4-5H2
34 atoms
Cl -1.694446 0.674596 -3.059603
Cl -3.32507 3.358823 1.264287
F  3.596959 -1.007415 1.024867
F  4.106616 -0.621799 -1.034587
F  5.150083 1.191409 0.659326
F  3.173303 1.648624 1.466929
O  2.056687 -0.103285 -0.3206
N  -1.509943 -2.632665 -0.071335
N  -0.877069 -3.232234 0.941888
N  -2.955422 -2.648307 1.553661
C  0.035579 -1.020642 -1.169673
C  -0.836776 -2.280239 -1.29811
C  1.324661 -1.332943 -0.428285
C  -0.76456 0.107499 -0.567755
C  -1.597762 0.910809 -1.343849
C  -0.770029 0.344078 0.805201
C  3.352878 -0.159582 -0.003379
C  -2.387565 1.911957 -0.799221
C  -1.548379 1.331613 1.382372
C  -2.735682 -2.278656 0.315317
C  -2.350069 2.113286 0.56861
C  3.83313 1.243513 0.358918
C  -1.78389 -3.220547 1.885005
H  0.316264 -0.75795 -2.191991
H  -1.604094 -2.118091 -2.05291
H  -0.239681 -3.129416 -1.628359
H  1.145978 -1.743918 0.565825
H  1.883151 -2.074989 -1.003473
H  -0.157081 -0.258309 1.461981
H  -3.019004 2.518515 -1.433086
H  -1.52428 1.484754 2.4519
H  -3.434186 -1.776819 -0.335848
H  3.668047 1.957566 -0.447478
H  -1.591668 -3.650342 2.855465
elementType: Cl F O N C H
totalener: -2061.43230733 hartree
nucrepener: 2360.40071333 hartree
electener: -4421.83302066 hartree
oneelecener: -7532.48804160 hartree
twoeener: 3110.65502095 hartree
cpcmener: -0.03081761 hartree
kineticenergy: 2055.88013866 hartree
xcener: -143.924881145182 hartree
chargesum: 0.0000000
charge: -0.080374 -0.085713 -0.198711 -0.201911 -0.201042 -0.200493 -0.293708 0.138559 -0.376270 -0.405043 0.098076 -0.132165 -0.065894 0.014375 -0.017767 -0.158849 0.444103 -0.119117 -0.158313 0.053840 0.094224 0.286605 0.077000 0.085998 0.136663 0.132640 0.122482 0.140769 0.138961 0.124733 0.147673 0.170443 0.125184 0.163042
qa: -0.0804 -0.0857 -0.1987 -0.2019 -0.2010 -0.2005 -0.2937 0.1386 -0.3763 -0.4050 0.0981 -0.1322 -0.0659 0.0144 -0.0178 -0.1588 0.4441 -0.1191 -0.1583 0.0538 0.0942 0.2866 0.0770 0.0860 0.1367 0.1326 0.1225 0.1408 0.1390 0.1247 0.1477 0.1704 0.1252 0.1630
va: 1.2493 1.2175 1.1006 1.0949 1.0848 1.0825 2.0717 3.3118 2.8561 3.0176 3.8216 3.9057 3.8822 3.4746 3.9668 3.8770 4.3443 4.0588 4.0707 4.0690 3.8640 4.1215 4.0274 1.0395 1.0044 1.0107 1.0227 1.0018 1.0028 1.0200 1.0038 0.9943 0.9842 0.9948
dispcorr: -0.019541209 hartree
energy: -2061.451848537877
dipole: -12.44142 12.17828 -0.26314 -15.62236 15.41583 -0.20653 -1.19282 -0.73289 -1.92571
magnitude: 1.95455 au
magnitude: 4.96807 debye
