program: Orca
programVersion: 4.2.1
elementType: Cl Cl F F F F O N N N C C C C C C C C C C C C C H H H H H H H H H H H
charge: 0
multiplicity: 1
keywords: wb97x-d3
keywords: def2-TZVPP
keywords: def2/J RIJCOSX GRIDX6 NOFINALGRIDX
keywords: grid4 nofinalgrid
keywords: scfconv7
keywords: smallprint printgap noloewdin
keywords: NOSOSCF
formula: C13H11Cl2F4N3O
InChI: InChI=1S/C13H11Cl2F4N3O/c14-9-1-2-10(11(15)3-9)8(4-22-7-20-6-21-22)5-23-13(18,19)12(16)17/h1-3,6-8,12H,4-5H2
34 atoms
Cl -2.593007 0.473176 -2.621469
Cl -2.451453 5.042267 0.133826
F  2.794001 -2.064582 0.565641
F  3.380466 -0.799684 -1.081945
F  2.930591 0.126392 2.272354
F  3.624099 1.341163 0.593912
O  1.50743 -0.318872 0.034642
N  -0.73007 -2.890498 0.79981
N  -1.319344 -3.67557 -0.10558
N  0.260671 -4.81294 1.01069
C  -0.81018 -0.742955 -0.399077
C  -1.058231 -1.488767 0.91557
C  0.609651 -0.895354 -0.922454
C  -1.219884 0.705078 -0.278289
C  -2.028306 1.333052 -1.225478
C  -0.790834 1.48731 0.794003
C  2.753954 -0.77958 0.119733
C  -2.41484 2.660185 -1.111807
C  -1.154125 2.815481 0.933574
C  0.208337 -3.578202 1.448548
C  -1.972094 3.389792 -0.023858
C  3.569492 0.082219 1.081927
C  -0.693124 -4.81167 0.062472
H  -1.436698 -1.221652 -1.153321
H  -0.466054 -1.09497 1.739204
H  -2.106224 -1.389623 1.196214
H  0.832488 -1.949996 -1.098265
H  0.711462 -0.371893 -1.874492
H  -0.150034 1.060978 1.553412
H  -3.048389 3.11245 -1.861778
H  -0.800391 3.3882 1.779137
H  0.80541 -3.152462 2.23875
H  4.580468 -0.301777 1.221397
H  -0.939248 -5.681345 -0.526191
elementType: Cl F O N C H
totalener: -2061.43200024 hartree
nucrepener: 2349.71179298 hartree
electener: -4411.14379322 hartree
oneelecener: -7511.00585354 hartree
twoeener: 3099.86206032 hartree
cpcmener: -0.02842459 hartree
kineticenergy: 2055.87795782 hartree
xcener: -143.922636952459 hartree
chargesum: 0.0000000
charge: -0.083103 -0.086325 -0.202657 -0.198120 -0.201945 -0.202246 -0.288468 0.103373 -0.361840 -0.414898 0.122352 -0.135846 -0.028961 0.009584 -0.017845 -0.172662 0.438721 -0.128934 -0.170176 0.072843 0.094641 0.287217 0.072292 0.091342 0.125890 0.138499 0.124307 0.134923 0.132453 0.124792 0.147405 0.170093 0.139966 0.163328
qa: -0.0831 -0.0863 -0.2027 -0.1981 -0.2019 -0.2022 -0.2885 0.1034 -0.3618 -0.4149 0.1224 -0.1358 -0.0290 0.0096 -0.0178 -0.1727 0.4387 -0.1289 -0.1702 0.0728 0.0946 0.2872 0.0723 0.0913 0.1259 0.1385 0.1243 0.1349 0.1325 0.1248 0.1474 0.1701 0.1400 0.1633
va: 1.2408 1.2173 1.0908 1.1050 1.0860 1.0852 2.0858 3.3426 2.8619 3.0238 3.6582 3.9332 3.8782 3.5249 3.9922 3.9887 4.3487 4.0469 4.0540 4.0439 3.8533 4.1165 4.0362 1.0690 0.9986 1.0035 1.0011 1.0077 1.0218 1.0198 1.0048 1.0023 0.9830 0.9949
dispcorr: -0.018874153 hartree
energy: -2061.450874391507
dipole: -6.90290 7.25268 0.34978 -13.29734 13.97875 0.68141 4.17753 -3.51174 0.66579
magnitude: 1.01486 au
magnitude: 2.57956 debye
