program: Gaussian 09
title: 000030859
version: EM64L-G09RevD.01
frameworkgroup: C1[X(C11H15Cl2O3PS2)]
method: RPBEPBE
basis: SDD
operation: Freq
keyword: #p
keyword: freq=noraman
keyword: PBEPBE/SDD
title: #p freq=noraman PBEPBE/SDD
converged: YES YES NO NO
title: Mulliken charges:
elementType: Cl Cl S S P O O O C C C C C C C C C C C H H H H H H H H H H H H H H H
charge: -0.020821 -0.026618 -0.215073 0.272500 0.869525 -0.485128 -0.464369 -0.479250 0.486182 -0.216564 -0.213151 -0.369149 -0.278855 -0.210003 -0.078472 -0.070168 -0.654472 -0.652520 -0.874554 0.240691 0.229008 0.230056 0.232937 0.303567 0.269000 0.238109 0.212684 0.231282 0.214576 0.232143 0.238009 0.270875 0.269236 0.268788
chargesum: 0.00000
title: Mulliken charges with hydrogens summed into heavy atoms:
elementType: Cl Cl S S P O O O C C C C C C C C C C C
charge: -0.020821 -0.026618 -0.215073 0.272500 0.869525 -0.485128 -0.464369 -0.479250 0.486182 0.253135 0.249842 -0.369149 0.024712 -0.210003 -0.078472 0.198832 0.027604 0.032208 -0.065655
polarizability: 2.91357533e+02 9.86526944e+00 2.31739742e+02 9.63462862e+00 -9.07089372e+00 1.43093187e+02
1716.lowfreq: -5.2459 -0.0020 -0.0018 -0.0001 2.4906 8.8936 12.5516 22.2409 27.9694
frequency: 12.3152 22.2129 27.9443 29.0576 44.9027 53.5897 61.4447 68.0454 76.3811 94.4235 111.8746 132.0243 142.6412 159.4682 184.4604 198.1689 207.4481 222.6542 241.9025 255.5358 259.5514 265.2350 274.8938 293.6611 309.6287 331.5068 339.7273 370.6345 406.0851 432.1277 451.9379 478.0419 514.5387 543.5781 600.2876 633.4073 656.0067 672.9953 693.4862 695.9689 712.3774 740.3074 811.6417 812.5951 841.7614 869.2160 874.4799 886.4790 891.3924 967.5002 991.7377 1011.9012 1019.0466 1037.7620 1103.9115 1105.8754 1106.6303 1134.3660 1134.8157 1202.8874 1243.5578 1257.7199 1258.0059 1314.4550 1352.2640 1354.9741 1359.0076 1376.4887 1395.8325 1395.9972 1438.0717 1457.5368 1458.9427 1459.0241 1464.3680 1476.6466 1477.7821 1486.5340 1487.8440 1543.6153 1586.4726 2992.1137 2994.3416 2996.8175 2998.0117 3007.9931 3060.5726 3063.0358 3092.8823 3093.4982 3111.2127 3112.3119 3127.1928 3135.0446 3174.4357 3182.0823
redmass: 6.6283 6.0438 4.2044 4.1585 3.3169 2.1204 3.2183 2.8527 11.4562 4.5209 5.7934 8.4489 6.2376 8.2302 6.0832 4.0902 2.5589 1.9986 1.4605 1.3873 2.1122 4.3311 3.6423 5.2674 23.8142 6.1073 10.0369 8.8558 7.2271 6.2259 3.7145 8.8993 6.9163 8.2019 11.3955 9.3463 7.6474 7.8355 3.7274 5.9582 6.9777 11.1710 1.0884 1.0999 1.4603 4.9683 4.6176 1.6198 4.9301 1.1814 1.2872 2.3562 2.6754 5.3772 2.2037 2.0580 2.1952 1.4311 1.4259 3.4059 1.3717 1.1401 1.1393 7.6998 1.1596 1.2513 1.2476 9.8571 1.2443 1.2410 2.6144 1.0397 1.0512 1.0401 1.1088 1.0563 1.0548 1.0773 1.0795 8.5173 8.4945 1.0524 1.0474 1.0405 1.0456 1.0292 1.1080 1.1081 1.0981 1.0981 1.1026 1.1025 1.1065 1.1019 1.0930 1.0906
irintensity: 0.2504 0.3813 1.6145 2.1342 0.2565 1.4890 0.7255 3.1110 0.9078 1.9535 1.6235 1.2641 1.2452 2.2423 0.4842 4.3780 3.8006 4.1455 1.6270 5.6137 8.5611 1.4591 5.2476 1.2210 0.7596 7.3180 3.9883 17.7041 6.4330 2.8737 17.4825 6.8226 1.9346 38.4803 49.2817 20.7053 39.7536 17.8004 6.1606 63.9759 130.4466 149.5227 3.3430 3.8456 8.9018 274.6033 162.1504 42.9826 41.5936 8.1186 1.2454 148.7589 102.2279 97.2434 25.7736 35.8653 2.9351 2.9798 6.3458 34.5690 25.6809 0.4501 0.1572 42.4341 3.9099 10.5080 6.7098 20.4570 27.7730 28.0356 289.3326 12.7176 13.8651 14.8895 13.8268 4.4451 9.7087 11.1113 13.0532 4.7514 2.4283 23.7256 15.1858 25.6130 23.2707 20.5764 10.5055 7.9387 28.0547 23.5592 32.2198 31.5256 14.9332 5.8075 2.3378 0.3666
temp: 298.150 k
press: 1.00000 atm
elementType: 17 17 16 16 15 8 8 8 6 6 6 6 6 6 6 6 6 6 6 1 1 1 1 1 1 1 1 1 1 1 1 1 1 1
symmnumber: 1
zpe: 637688.3 jmol-1
zpe.correction: 0.242883 hartree
zpe.thermalcorrener: 0.266698 hartree
zpe.thermalcorrenthalpy: 0.267643 hartree
zpe.thermalcorrgfe: 0.184550 hartree
zpe.sumelectzpe: -2709.835731 hartree
zpe.sumelectthermal: -2709.811915 hartree
zpe.sumelectthermalent: -2709.810971 hartree
zpe.sumelectthermalfe: -2709.894064 hartree
dipole: -0.6713 -1.1100 0.0434
dipole: 1.2980
quadrupole: -124.8832 -134.8058 -157.9600
quadrupole: -14.0535 4.1915 1.3258
quadrupole: 14.3331 4.4106 -18.7437 -14.0535 4.1915 1.3258
hfenergy: -2710.0786135 hartree
pointgroup: C01 [X(C11H15Cl2O3P1S2)]
dipole: 0.2197106 -0.4500223 -0.0998987 debye
polarizability: 288.9839905|-16.8934905|228.5308737|6.5796918|23.5916989|148.6755973 unknown
InChI: InChI=1S/C11H15Cl2O3PS2/c1-4-14-17(18,15-5-2)16-10-6-9(13)11(19-3)7-8(10)12/h6-7H,4-5H2,1-3H3
charge 0 multiplicity 1
34 atoms
Cl -0.711689 -3.007362 -0.574102
Cl -2.909586 2.84975 0.872526
S  1.988061 0.178275 -2.465911
S  -4.981679 0.644146 -0.170853
P  2.211012 0.064742 -0.422574
O  0.917077 -0.677879 0.518306
O  3.516813 -0.841664 0.222773
O  2.356361 1.535855 0.459109
C  -0.433614 -0.362293 0.294085
C  3.686396 -2.258544 -0.245586
C  3.233557 2.624259 -0.082381
C  -1.328335 -1.353237 -0.165333
C  -0.93684 0.920237 0.613317
C  -3.218674 0.200184 -0.003901
C  -2.304445 1.183971 0.456707
C  -2.700936 -1.082932 -0.309341
C  4.956204 -2.770135 0.424595
C  2.870211 3.887377 0.691102
C  -5.713126 -0.958927 -0.821015
H  2.791969 -2.831434 0.060358
H  3.765454 -2.259074 -1.349548
H  4.285457 2.327556 0.08248
H  3.045087 2.730453 -1.168058
H  -0.246901 1.685442 0.980475
H  -3.354826 -1.881777 -0.665642
H  4.860562 -2.730762 1.522545
H  5.135772 -3.819382 0.125643
H  5.829185 -2.1662 0.124687
H  3.514826 4.722305 0.359474
H  1.818018 4.168381 0.515241
H  3.021137 3.740072 1.773703
H  -5.27127 -1.226234 -1.793493
H  -6.78513 -0.746143 -0.953344
H  -5.590505 -1.773425 -0.090242
