program: Orca
programVersion: 4.2.1
elementType: Cl Cl F F F F O N N N C C C C C C C C C C C C C H H H H H H H H H H H
charge: 0
multiplicity: 1
keywords: wb97x-d3
keywords: def2-TZVPP
keywords: def2/J RIJCOSX GRIDX6 NOFINALGRIDX
keywords: grid4 nofinalgrid
keywords: scfconv7
keywords: smallprint printgap noloewdin
keywords: NOSOSCF
formula: C13H11Cl2F4N3O
InChI: InChI=1S/C13H11Cl2F4N3O/c14-9-1-2-10(11(15)3-9)8(4-22-7-20-6-21-22)5-23-13(18,19)12(16)17/h1-3,6-8,12H,4-5H2
34 atoms
Cl -0.895895 0.653642 -2.911215
Cl -3.177778 3.499153 0.992908
F  3.646893 -0.760569 -0.987627
F  2.256721 0.88534 -1.122745
F  4.670691 0.295625 1.347106
F  3.251184 1.949458 1.202413
O  2.15094 -0.478697 0.651301
N  -1.568986 -2.729677 0.141068
N  -1.131977 -3.458738 1.172703
N  -3.20381 -2.696536 1.574525
C  0.205041 -1.19307 -0.713403
C  -0.720403 -2.393111 -0.975614
C  1.317041 -1.576925 0.257275
C  -0.597222 0.007998 -0.286742
C  -1.156048 0.886437 -1.212762
C  -0.882716 0.249165 1.055305
C  2.948608 0.123009 -0.233773
C  -1.947456 1.961074 -0.837687
C  -1.671138 1.310478 1.464906
C  -2.793324 -2.27279 0.40432
C  -2.194646 2.162747 0.508412
C  3.941579 1.036725 0.483684
C  -2.145577 -3.41041 1.998171
H  0.661122 -0.998879 -1.685106
H  -1.366452 -2.167965 -1.822732
H  -0.136728 -3.272177 -1.245899
H  0.927011 -1.955028 1.198889
H  1.916938 -2.376879 -0.180674
H  -0.48788 -0.405985 1.820876
H  -2.361493 2.624632 -1.583907
H  -1.869101 1.464873 2.516116
H  -3.352195 -1.659321 -0.285054
H  4.606922 1.546246 -0.214336
H  -2.121417 -3.91944 2.948701
elementType: Cl F O N C H
totalener: -2061.43034179 hartree
nucrepener: 2403.57285850 hartree
electener: -4465.00320028 hartree
oneelecener: -7619.19742274 hartree
twoeener: 3154.19422246 hartree
cpcmener: -0.03030193 hartree
kineticenergy: 2055.88397108 hartree
xcener: -143.926516026049 hartree
chargesum: 0.0000000
charge: -0.081891 -0.086059 -0.200314 -0.201489 -0.200227 -0.199768 -0.306079 0.128313 -0.374783 -0.406644 0.047945 -0.106913 -0.036933 0.000754 -0.005899 -0.150759 0.455773 -0.123473 -0.158480 0.050070 0.096335 0.287398 0.079295 0.090429 0.134444 0.133254 0.117139 0.138670 0.144427 0.124820 0.147947 0.172933 0.126802 0.162964
qa: -0.0819 -0.0861 -0.2003 -0.2015 -0.2002 -0.1998 -0.3061 0.1283 -0.3748 -0.4066 0.0479 -0.1069 -0.0369 0.0008 -0.0059 -0.1508 0.4558 -0.1235 -0.1585 0.0501 0.0963 0.2874 0.0793 0.0904 0.1344 0.1333 0.1171 0.1387 0.1444 0.1248 0.1479 0.1729 0.1268 0.1630
va: 1.2454 1.2172 1.1007 1.0939 1.0858 1.0861 2.0824 3.3254 2.8654 3.0195 3.7644 3.9076 3.8894 3.3806 3.9819 3.8917 4.2925 4.0624 4.0661 4.0743 3.8588 4.1510 4.0261 1.0490 1.0034 1.0104 1.0212 1.0005 1.0009 1.0202 1.0040 0.9928 0.9821 0.9947
dispcorr: -0.020384876 hartree
energy: -2061.450726661751
dipole: -10.68225 11.26615 0.58390 -18.38151 17.87474 -0.50678 3.40300 -4.86653 -1.46353
magnitude: 1.65520 au
magnitude: 4.20718 debye
