program: Orca
programVersion: 4.2.1
elementType: Cl Cl F F F F O N N N C C C C C C C C C C C C C H H H H H H H H H H H
charge: 0
multiplicity: 1
keywords: wb97x-d3
keywords: def2-TZVPP
keywords: def2/J RIJCOSX GRIDX6 NOFINALGRIDX
keywords: grid4 nofinalgrid
keywords: scfconv7
keywords: smallprint printgap noloewdin
keywords: NOSOSCF
formula: C13H11Cl2F4N3O
InChI: InChI=1S/C13H11Cl2F4N3O/c14-9-1-2-10(11(15)3-9)8(4-22-7-20-6-21-22)5-23-13(18,19)12(16)17/h1-3,6-8,12H,4-5H2
34 atoms
Cl -0.72615 0.994406 -2.827058
Cl -3.074416 3.527579 1.246349
F  4.07099 -1.2101 0.054482
F  2.989401 -0.26486 -1.554767
F  3.977773 1.129723 1.507928
F  2.864863 2.079461 -0.114349
O  2.014743 -0.441328 0.454151
N  -1.647199 -2.828729 0.002035
N  -1.154556 -3.599723 0.976576
N  -3.269328 -3.009809 1.438151
C  0.075434 -1.196281 -0.79501
C  -0.840167 -2.387669 -1.109611
C  1.21228 -1.590294 0.140716
C  -0.707132 -0.008436 -0.295965
C  -1.110225 1.027432 -1.135944
C  -1.0902 0.085701 1.040976
C  3.153807 -0.241505 -0.205441
C  -1.833622 2.118526 -0.678159
C  -1.819836 1.155157 1.529383
C  -2.898789 -2.478327 0.29837
C  -2.179599 2.17058 0.659848
C  3.758839 1.109049 0.173833
C  -2.162272 -3.679625 1.80747
H  0.523527 -0.948921 -1.757682
H  -1.518745 -2.115135 -1.916226
H  -0.24855 -3.231982 -1.461491
H  0.856732 -1.965365 1.097906
H  1.80314 -2.387959 -0.313539
H  -0.806458 -0.690403 1.740804
H  -2.116678 2.911976 -1.355593
H  -2.095692 1.193188 2.573683
H  -3.501176 -1.855312 -0.343361
H  4.693535 1.302288 -0.353698
H  -2.099062 -4.255503 2.71725
elementType: Cl F O N C H
totalener: -2061.43153575 hartree
nucrepener: 2385.19309070 hartree
electener: -4446.62462645 hartree
oneelecener: -7582.51150089 hartree
twoeener: 3135.88687443 hartree
cpcmener: -0.03081636 hartree
kineticenergy: 2055.87502955 hartree
xcener: -143.923106586117 hartree
chargesum: 0.0000000
charge: -0.082565 -0.086366 -0.200976 -0.204603 -0.200797 -0.197788 -0.301402 0.118467 -0.371275 -0.408597 0.052333 -0.084102 -0.037729 0.074904 -0.032604 -0.217510 0.450775 -0.116580 -0.139085 0.052791 0.079170 0.282934 0.076843 0.077469 0.129299 0.133510 0.125434 0.135864 0.152149 0.124388 0.148776 0.177582 0.126657 0.162637
qa: -0.0826 -0.0864 -0.2010 -0.2046 -0.2008 -0.1978 -0.3014 0.1185 -0.3713 -0.4086 0.0523 -0.0841 -0.0377 0.0749 -0.0326 -0.2175 0.4508 -0.1166 -0.1391 0.0528 0.0792 0.2829 0.0768 0.0775 0.1293 0.1335 0.1254 0.1359 0.1521 0.1244 0.1488 0.1776 0.1267 0.1626
va: 1.2433 1.2173 1.0977 1.0918 1.0844 1.0890 2.0820 3.3462 2.8615 3.0197 3.8177 3.9130 3.8682 3.3992 3.9938 3.9497 4.3466 4.0439 4.0436 4.0666 3.8695 4.1371 4.0300 1.0598 1.0033 1.0063 1.0223 1.0071 0.9961 1.0194 1.0036 0.9919 0.9818 0.9952
dispcorr: -0.019739358 hartree
energy: -2061.451275108138
dipole: -11.95803 12.46407 0.50604 -18.97833 18.38758 -0.59075 2.82056 -4.20600 -1.38544
magnitude: 1.58887 au
magnitude: 4.03858 debye
