program: Orca
programVersion: 4.2.1
elementType: Cl Cl F F F F O N N N C C C C C C C C C C C C C H H H H H H H H H H H
charge: 0
multiplicity: 1
keywords: wb97x-d3
keywords: def2-TZVPP
keywords: def2/J RIJCOSX GRIDX6 NOFINALGRIDX
keywords: grid4 nofinalgrid
keywords: scfconv7
keywords: smallprint printgap noloewdin
keywords: NOSOSCF
formula: C13H11Cl2F4N3O
InChI: InChI=1S/C13H11Cl2F4N3O/c14-9-1-2-10(11(15)3-9)8(4-22-7-20-6-21-22)5-23-13(18,19)12(16)17/h1-3,6-8,12H,4-5H2
34 atoms
Cl -1.000436 0.821491 -2.787645
Cl -3.578577 3.234894 1.222743
F  4.152088 -1.195132 0.545855
F  3.328361 -0.276865 -1.223001
F  3.212212 2.146425 0.056236
F  5.194627 1.230649 0.030182
O  2.112601 -0.293101 0.654473
N  -1.5804 -2.656228 -0.095737
N  -1.242448 -3.324816 1.010254
N  -3.405188 -2.730626 1.083825
C  0.227381 -1.043599 -0.676586
C  -0.609504 -2.266528 -1.087927
C  1.31454 -1.438622 0.312291
C  -0.673193 0.066106 -0.195503
C  -1.301053 0.938139 -1.083211
C  -0.993934 0.210719 1.15253
C  3.336287 -0.191167 0.131772
C  -2.191064 1.915714 -0.665678
C  -1.8808 1.172607 1.603614
C  -2.861313 -2.296145 -0.026767
C  -2.471289 2.022148 0.684588
C  3.955052 1.13727 0.561768
C  -2.368196 -3.348272 1.676819
H  0.728928 -0.72788 -1.593337
H  -1.155673 -2.045378 -2.003206
H  0.036283 -3.117611 -1.300668
H  0.917297 -1.822062 1.249908
H  1.918311 -2.236663 -0.122936
H  -0.55107 -0.445556 1.889618
H  -2.65668 2.576608 -1.38318
H  -2.10334 1.252025 2.658234
H  -3.357424 -1.742816 -0.808588
H  4.013503 1.230891 1.645949
H  -2.444982 -3.837441 2.635103
elementType: Cl F O N C H
totalener: -2061.43197564 hartree
nucrepener: 2368.62280800 hartree
electener: -4430.05478364 hartree
oneelecener: -7549.03379127 hartree
twoeener: 3118.97900764 hartree
cpcmener: -0.03072260 hartree
kineticenergy: 2055.88376020 hartree
xcener: -143.925114804412 hartree
chargesum: 0.0000000
charge: -0.080184 -0.085637 -0.201381 -0.201021 -0.199999 -0.200842 -0.310741 0.138605 -0.373468 -0.404975 0.070158 -0.129536 -0.030666 0.021236 -0.016287 -0.166214 0.457701 -0.115869 -0.161475 0.057418 0.095051 0.283720 0.074120 0.080041 0.137597 0.134156 0.123615 0.130886 0.145142 0.125985 0.147869 0.169454 0.123214 0.162326
qa: -0.0802 -0.0856 -0.2014 -0.2010 -0.2000 -0.2008 -0.3107 0.1386 -0.3735 -0.4050 0.0702 -0.1295 -0.0307 0.0212 -0.0163 -0.1662 0.4577 -0.1159 -0.1615 0.0574 0.0951 0.2837 0.0741 0.0800 0.1376 0.1342 0.1236 0.1309 0.1451 0.1260 0.1479 0.1695 0.1232 0.1623
va: 1.2495 1.2175 1.0959 1.0961 1.0840 1.0843 2.0690 3.3132 2.8583 3.0200 3.7989 3.9094 3.8658 3.4589 3.9717 3.9043 4.3335 4.0541 4.0704 4.0678 3.8613 4.1251 4.0333 1.0546 1.0031 1.0089 1.0228 1.0095 1.0013 1.0197 1.0038 0.9949 0.9845 0.9952
dispcorr: -0.019739398 hartree
energy: -2061.451715035873
dipole: -12.97704 13.14228 0.16524 -17.55397 16.90239 -0.65158 5.32268 -5.46801 -0.14533
magnitude: 0.68774 au
magnitude: 1.74809 debye
