program: Orca
programVersion: 4.2.1
elementType: Cl Cl F F F F O N N N C C C C C C C C C C C C C H H H H H H H H H H H
charge: 0
multiplicity: 1
keywords: wb97x-d3
keywords: def2-TZVPP
keywords: def2/J RIJCOSX GRIDX6 NOFINALGRIDX
keywords: grid4 nofinalgrid
keywords: scfconv7
keywords: smallprint printgap noloewdin
keywords: NOSOSCF
formula: C13H11Cl2F4N3O
InChI: InChI=1S/C13H11Cl2F4N3O/c14-9-1-2-10(11(15)3-9)8(4-22-7-20-6-21-22)5-23-13(18,19)12(16)17/h1-3,6-8,12H,4-5H2
34 atoms
Cl -2.200092 0.524726 -2.637292
Cl -2.271624 5.032669 0.230069
F  3.049631 -1.934196 -0.072571
F  3.132776 -0.27503 -1.452125
F  3.204612 -0.189908 2.05343
F  3.312608 1.485852 0.656151
O  1.4419 -0.386368 0.000808
N  -0.844189 -2.97964 0.968527
N  -1.84952 -3.709821 0.483121
N  -0.045363 -4.996388 0.833892
C  -0.88028 -0.822792 -0.214357
C  -0.958699 -1.549578 1.131708
C  0.480205 -0.983358 -0.878133
C  -1.243622 0.636879 -0.093361
C  -1.839316 1.331901 -1.145503
C  -0.964217 1.36685 1.059207
C  2.738012 -0.616564 -0.200576
C  -2.160833 2.677346 -1.062558
C  -1.273737 2.711439 1.176298
C  0.220854 -3.756032 1.163237
C  -1.873188 3.355412 0.108621
C  3.577104 0.169429 0.805038
C  -1.323709 -4.905654 0.42796
H  -1.598691 -1.30706 -0.879908
H  -0.170529 -1.24451 1.817197
H  -1.909859 -1.338957 1.617101
H  0.702672 -2.038524 -1.051622
H  0.491167 -0.4794 -1.845864
H  -0.495756 0.884786 1.905764
H  -2.626146 3.182833 -1.89714
H  -1.043695 3.243186 2.08866
H  1.152254 -3.386779 1.561194
H  4.64508 -0.006644 0.675644
H  -1.89071 -5.75315 0.077684
elementType: Cl F O N C H
totalener: -2061.43313273 hartree
nucrepener: 2346.99917588 hartree
electener: -4408.43230861 hartree
oneelecener: -7505.38390653 hartree
twoeener: 3096.95159792 hartree
cpcmener: -0.02858822 hartree
kineticenergy: 2055.88891970 hartree
xcener: -143.924745157744 hartree
chargesum: -0.0000000
charge: -0.084235 -0.087251 -0.204925 -0.199400 -0.202815 -0.201697 -0.275629 0.105956 -0.355276 -0.416405 0.137362 -0.162322 -0.068978 0.040783 -0.039218 -0.184873 0.438029 -0.122748 -0.156533 0.063014 0.090059 0.284749 0.071527 0.099893 0.129695 0.149394 0.138435 0.131663 0.136350 0.125551 0.147397 0.168151 0.140190 0.164108
qa: -0.0842 -0.0873 -0.2049 -0.1994 -0.2028 -0.2017 -0.2756 0.1060 -0.3553 -0.4164 0.1374 -0.1623 -0.0690 0.0408 -0.0392 -0.1849 0.4380 -0.1227 -0.1565 0.0630 0.0901 0.2847 0.0715 0.0999 0.1297 0.1494 0.1384 0.1317 0.1363 0.1256 0.1474 0.1682 0.1402 0.1641
va: 1.2414 1.2160 1.0904 1.1020 1.0834 1.0861 2.0853 3.3507 2.8856 3.0261 3.6547 3.9106 3.8726 3.5126 4.0168 3.9805 4.3419 4.0517 4.0407 4.0493 3.8582 4.1237 4.0386 1.0504 1.0057 1.0050 0.9929 1.0158 1.0091 1.0196 1.0046 1.0070 0.9827 0.9943
dispcorr: -0.018473226 hartree
energy: -2061.451605960372
dipole: -8.31798 8.88606 0.56808 -14.38437 15.08509 0.70072 5.95599 -5.44172 0.51427
magnitude: 1.03836 au
magnitude: 2.63931 debye
