program: Orca
programVersion: 4.2.1
elementType: Cl Cl F F F F O N N N C C C C C C C C C C C C C H H H H H H H H H H H
charge: 0
multiplicity: 1
keywords: wb97x-d3
keywords: def2-TZVPP
keywords: def2/J RIJCOSX GRIDX6 NOFINALGRIDX
keywords: grid4 nofinalgrid
keywords: scfconv7
keywords: smallprint printgap noloewdin
keywords: NOSOSCF
formula: C13H11Cl2F4N3O
InChI: InChI=1S/C13H11Cl2F4N3O/c14-9-1-2-10(11(15)3-9)8(4-22-7-20-6-21-22)5-23-13(18,19)12(16)17/h1-3,6-8,12H,4-5H2
34 atoms
Cl -1.42214 -0.281201 -2.447604
Cl -4.946872 2.739167 0.18617
F  3.068809 -0.44057 -1.558437
F  4.220375 1.288403 -0.978173
F  4.258842 -1.93832 0.394069
F  5.422242 -0.200504 1.02765
O  2.832002 0.381136 0.511391
N  -0.728641 -1.871772 0.951733
N  -1.802077 -1.712483 1.730123
N  -2.236513 -3.178029 0.08665
C  0.455505 0.067729 0.024982
C  0.4465 -1.040464 1.088282
C  1.592482 1.06013 0.258742
C  -0.874163 0.780183 0.004906
C  -1.793229 0.651894 -1.03339
C  -1.26916 1.543204 1.10191
C  3.676124 0.144213 -0.494642
C  -3.04558 1.247659 -0.990879
C  -2.505204 2.157578 1.173108
C  -1.008857 -2.733123 -0.026334
C  -3.387626 1.997845 0.118556
C  4.802633 -0.773921 -0.026732
C  -2.670248 -2.518122 1.176017
H  0.614522 -0.405322 -0.94408
H  1.328625 -1.671323 0.996864
H  0.438423 -0.629922 2.096371
H  1.673078 1.750456 -0.582571
H  1.421354 1.655242 1.154211
H  -0.600134 1.654158 1.945154
H  -3.739292 1.122722 -1.809996
H  -2.774058 2.740641 2.042102
H  -0.292309 -3.020621 -0.779365
H  5.52706 -0.9730 -0.815599
H  -3.66293 -2.638686 1.579968
elementType: Cl F O N C H
totalener: -2061.42883605 hartree
nucrepener: 2358.10019516 hartree
electener: -4419.52903121 hartree
oneelecener: -7528.04860904 hartree
twoeener: 3108.51957783 hartree
cpcmener: -0.03132632 hartree
kineticenergy: 2055.89751881 hartree
xcener: -143.926448331091 hartree
chargesum: -0.0000000
charge: -0.084471 -0.085616 -0.202145 -0.197368 -0.199360 -0.198361 -0.311522 0.119345 -0.336569 -0.403852 0.056712 -0.087034 -0.024755 0.021615 -0.005511 -0.190071 0.454904 -0.119259 -0.164838 0.030481 0.096035 0.280799 0.056052 0.084297 0.130713 0.126694 0.133051 0.133073 0.141783 0.124951 0.149182 0.177842 0.131091 0.162111
qa: -0.0845 -0.0856 -0.2021 -0.1974 -0.1994 -0.1984 -0.3115 0.1193 -0.3366 -0.4039 0.0567 -0.0870 -0.0248 0.0216 -0.0055 -0.1901 0.4549 -0.1193 -0.1648 0.0305 0.0960 0.2808 0.0561 0.0843 0.1307 0.1267 0.1331 0.1331 0.1418 0.1250 0.1492 0.1778 0.1311 0.1621
va: 1.2375 1.2182 1.0919 1.1040 1.0896 1.0872 2.0720 3.3608 2.8853 3.0160 3.7446 3.8335 3.8962 3.4861 3.9358 4.0108 4.3303 4.0506 4.0441 4.0670 3.8618 4.1305 4.0483 1.0602 1.0213 1.0106 1.0084 1.0013 1.0036 1.0194 1.0029 0.9953 0.9816 0.9965
dispcorr: -0.019977937 hartree
energy: -2061.448813984461
dipole: -7.30651 8.95477 1.64826 -2.57370 3.60646 1.03276 8.89527 -8.86519 0.03008
magnitude: 1.94532 au
magnitude: 4.94461 debye
