program: Orca
programVersion: 4.2.1
elementType: Cl Cl F F F F O N N N C C C C C C C C C C C C C H H H H H H H H H H H
charge: 0
multiplicity: 1
keywords: wb97x-d3
keywords: def2-TZVPP
keywords: def2/J RIJCOSX GRIDX6 NOFINALGRIDX
keywords: grid4 nofinalgrid
keywords: scfconv7
keywords: smallprint printgap noloewdin
keywords: NOSOSCF
formula: C13H11Cl2F4N3O
InChI: InChI=1S/C13H11Cl2F4N3O/c14-9-1-2-10(11(15)3-9)8(4-22-7-20-6-21-22)5-23-13(18,19)12(16)17/h1-3,6-8,12H,4-5H2
34 atoms
Cl -0.48613 0.328843 -2.385864
Cl -2.567739 3.429325 1.429186
F  2.103764 1.095004 1.090091
F  3.985014 0.04097 1.053668
F  2.492658 1.94655 -1.486381
F  4.391236 0.868376 -1.554713
O  2.395762 -0.554515 -0.395334
N  -1.794838 -2.923123 0.219658
N  -2.696376 -3.004011 1.199527
N  -3.716377 -2.772098 -0.78436
C  0.284289 -1.653524 -0.10974
C  -0.373641 -2.897488 0.490293
C  1.737638 -1.594224 0.341386
C  -0.450543 -0.385817 0.242366
C  -0.816054 0.568279 -0.70131
C  -0.76212 -0.109823 1.571682
C  2.964025 0.458156 0.25816
C  -1.466674 1.743212 -0.351501
C  -1.407365 1.050307 1.95577
C  -2.415318 -2.776983 -0.949538
C  -1.755117 1.970579 0.98061
C  3.512298 1.483034 -0.731787
C  -3.826624 -2.912607 0.547833
H  0.296742 -1.78243 -1.193088
H  0.093653 -3.792016 0.079207
H  -0.259804 -2.941725 1.571464
H  1.809482 -1.443783 1.420621
H  2.246531 -2.528893 0.102901
H  -0.485708 -0.817151 2.343674
H  -1.740974 2.464376 -1.108202
H  -1.632747 1.230235 2.997231
H  -1.894176 -2.694679 -1.890228
H  4.004507 2.315261 -0.2270
H  -4.775067 -2.950974 1.059503
elementType: Cl F O N C H
totalener: -2061.42984032 hartree
nucrepener: 2427.98632422 hartree
electener: -4489.41616454 hartree
oneelecener: -7668.31581392 hartree
twoeener: 3178.89964938 hartree
cpcmener: -0.03602421 hartree
kineticenergy: 2055.90374271 hartree
xcener: -143.927662289254 hartree
chargesum: -0.0000000
charge: -0.084490 -0.088422 -0.197362 -0.203002 -0.194200 -0.200986 -0.300922 0.124879 -0.356768 -0.415353 0.088441 -0.112395 -0.063594 0.015895 0.028698 -0.205742 0.459368 -0.130716 -0.141131 0.065290 0.091423 0.283859 0.066737 0.085666 0.141347 0.126196 0.123647 0.127781 0.138935 0.121847 0.149184 0.165996 0.125559 0.164337
qa: -0.0845 -0.0884 -0.1974 -0.2030 -0.1942 -0.2010 -0.3009 0.1249 -0.3568 -0.4154 0.0884 -0.1124 -0.0636 0.0159 0.0287 -0.2057 0.4594 -0.1307 -0.1411 0.0653 0.0914 0.2839 0.0667 0.0857 0.1413 0.1262 0.1236 0.1278 0.1389 0.1218 0.1492 0.1660 0.1256 0.1643
va: 1.2362 1.2152 1.0954 1.0969 1.0933 1.0842 2.0788 3.3743 2.8731 3.0314 3.7510 3.8812 3.9603 3.3958 3.9201 3.9190 4.3270 4.0670 4.0246 4.0557 3.8602 4.1384 4.0377 1.0429 0.9968 1.0029 1.0020 1.0043 1.0075 1.0214 1.0016 1.0017 0.9821 0.9939
dispcorr: -0.020521100 hartree
energy: -2061.450361417825
dipole: -10.14309 11.94866 1.80557 -20.94301 19.97843 -0.96458 6.95714 -6.02508 0.93207
magnitude: 2.24928 au
magnitude: 5.71721 debye
