program: Orca
programVersion: 4.2.1
elementType: Cl Cl F F F F O N N N C C C C C C C C C C C C C H H H H H H H H H H H
charge: 0
multiplicity: 1
keywords: wb97x-d3
keywords: def2-TZVPP
keywords: def2/J RIJCOSX GRIDX6 NOFINALGRIDX
keywords: grid4 nofinalgrid
keywords: scfconv7
keywords: smallprint printgap noloewdin
keywords: NOSOSCF
formula: C13H11Cl2F4N3O
InChI: InChI=1S/C13H11Cl2F4N3O/c14-9-1-2-10(11(15)3-9)8(4-22-7-20-6-21-22)5-23-13(18,19)12(16)17/h1-3,6-8,12H,4-5H2
34 atoms
Cl -1.09456 0.745204 -2.874352
Cl -3.273984 3.43351 1.198084
F  4.218401 -1.134394 0.053413
F  3.167637 -0.063644 -1.496997
F  4.186724 1.116588 1.647531
F  3.129731 2.20069 0.071184
O  2.186222 -0.323817 0.498167
N  -1.556245 -2.616884 -0.02823
N  -1.134109 -3.193489 1.099575
N  -3.32425 -2.753313 1.221955
C  0.240496 -1.060045 -0.776005
C  -0.647334 -2.275648 -1.093979
C  1.375674 -1.45802 0.160405
C  -0.598643 0.091185 -0.279395
C  -1.262647 0.945658 -1.158275
C  -0.808346 0.310534 1.080208
C  3.331167 -0.123619 -0.148345
C  -2.083634 1.974532 -0.722824
C  -1.623081 1.326437 1.549079
C  -2.861114 -2.352397 0.062404
C  -2.254456 2.154987 0.637837
C  3.981677 1.180632 0.313043
C  -2.227345 -3.256232 1.818149
H  0.691267 -0.784068 -1.731091
H  -1.249452 -2.068917 -1.976793
H  -0.033309 -3.146843 -1.32351
H  1.015517 -1.856976 1.106561
H  1.964132 -2.25009 -0.307462
H  -0.329582 -0.32432 1.81338
H  -2.579771 2.619387 -1.434849
H  -1.758276 1.464882 2.612784
H  -3.423248 -1.886852 -0.732041
H  4.929927 1.367232 -0.19369
H  -2.233902 -3.687087 2.807493
elementType: Cl F O N C H
totalener: -2061.44130214 hartree
nucrepener: 2379.70499094 hartree
electener: -4441.14629309 hartree
oneelecener: -7571.60163236 hartree
twoeener: 3130.45533927 hartree
cpcmener: -0.02670832 hartree
kineticenergy: 2055.84710712 hartree
xcener: -143.918515297478 hartree
chargesum: 0.0000000
charge: -0.081449 -0.083951 -0.200768 -0.204478 -0.198076 -0.197090 -0.294868 0.140053 -0.373136 -0.400186 0.072719 -0.141198 -0.035610 0.032682 -0.019622 -0.165625 0.447070 -0.114729 -0.158852 0.062534 0.091993 0.283900 0.076474 0.081810 0.134179 0.133523 0.125483 0.126923 0.139312 0.124400 0.144593 0.167922 0.122707 0.161362
qa: -0.0814 -0.0840 -0.2008 -0.2045 -0.1981 -0.1971 -0.2949 0.1401 -0.3731 -0.4002 0.0727 -0.1412 -0.0356 0.0327 -0.0196 -0.1656 0.4471 -0.1147 -0.1589 0.0625 0.0920 0.2839 0.0765 0.0818 0.1342 0.1335 0.1255 0.1269 0.1393 0.1244 0.1446 0.1679 0.1227 0.1614
va: 1.2483 1.2192 1.0981 1.0930 1.0884 1.0906 2.0932 3.3046 2.8454 3.0288 3.7590 3.9267 3.8630 3.4579 3.9714 3.9229 4.3526 4.0530 4.0764 4.0579 3.8739 4.1398 4.0282 1.0519 1.0039 1.0074 1.0264 1.0093 1.0048 1.0200 1.0050 0.9956 0.9829 0.9947
dispcorr: -0.019696521 hartree
energy: -2061.460998666194
dipole: -10.65315 11.39810 0.74495 -17.76066 17.11198 -0.64868 2.57506 -3.86448 -1.28942
magnitude: 1.62430 au
magnitude: 4.12864 debye
