program: Orca
programVersion: 4.2.1
elementType: Cl Cl F F F F O N N N C C C C C C C C C C C C C H H H H H H H H H H H
charge: 0
multiplicity: 1
keywords: wb97x-d3
keywords: def2-TZVPP
keywords: def2/J RIJCOSX GRIDX6 NOFINALGRIDX
keywords: grid4 nofinalgrid
keywords: scfconv7
keywords: smallprint printgap noloewdin
keywords: NOSOSCF
formula: C13H11Cl2F4N3O
InChI: InChI=1S/C13H11Cl2F4N3O/c14-9-1-2-10(11(15)3-9)8(4-22-7-20-6-21-22)5-23-13(18,19)12(16)17/h1-3,6-8,12H,4-5H2
34 atoms
Cl -2.517376 0.14401 -2.406811
Cl -4.273728 4.709606 -0.254087
F  3.652717 0.490369 0.818221
F  2.748629 -0.894321 2.203515
F  5.000454 -1.826254 0.992709
F  4.064347 -1.605785 -0.968917
O  1.823263 -0.622043 0.187472
N  -0.401091 -2.353883 0.473862
N  -0.200803 -2.945778 -0.702596
N  0.896983 -4.032246 0.916774
C  -0.439144 0.048697 -0.150018
C  -1.141177 -1.118701 0.561143
C  0.891469 0.427177 0.487009
C  -1.387435 1.222861 -0.181778
C  -2.36916 1.34403 -1.165932
C  -1.351262 2.219278 0.790893
C  2.962872 -0.674036 0.879081
C  -3.260229 2.404775 -1.199676
C  -2.224856 3.293819 0.783933
C  0.260938 -3.004959 1.430444
C  -3.17443 3.377094 -0.218544
C  3.816983 -1.822753 0.341189
C  0.579356 -3.948857 -0.390853
H  -0.230673 -0.252666 -1.180014
H  -1.285071 -0.891048 1.617668
H  -2.127325 -1.283735 0.127687
H  1.253738 1.365114 0.061196
H  0.793757 0.551767 1.568235
H  -0.620964 2.173345 1.587609
H  -4.005285 2.469262 -1.980402
H  -2.159233 4.050652 1.55298
H  0.245398 -2.706052 2.466816
H  3.330217 -2.7912 0.468745
H  0.92979 -4.650511 -1.131971
elementType: Cl F O N C H
totalener: -2061.44082398 hartree
nucrepener: 2330.21118088 hartree
electener: -4391.65200487 hartree
oneelecener: -7471.89771151 hartree
twoeener: 3080.24570665 hartree
cpcmener: -0.02724799 hartree
kineticenergy: 2055.84362148 hartree
xcener: -143.917287263762 hartree
chargesum: 0.0000000
charge: -0.075981 -0.082957 -0.194616 -0.206056 -0.197830 -0.197646 -0.287040 0.126409 -0.332549 -0.424251 0.120143 -0.104819 -0.088852 0.014572 -0.035014 -0.153448 0.452077 -0.126946 -0.167463 0.041431 0.095520 0.285131 0.060195 0.082941 0.127944 0.132977 0.149768 0.122186 0.142912 0.125083 0.145129 0.174640 0.116118 0.160292
qa: -0.0760 -0.0830 -0.1946 -0.2061 -0.1978 -0.1976 -0.2870 0.1264 -0.3325 -0.4243 0.1201 -0.1048 -0.0889 0.0146 -0.0350 -0.1534 0.4521 -0.1269 -0.1675 0.0414 0.0955 0.2851 0.0602 0.0829 0.1279 0.1330 0.1498 0.1222 0.1429 0.1251 0.1451 0.1746 0.1161 0.1603
va: 1.2520 1.2206 1.1105 1.0847 1.0919 1.0853 2.0808 3.3426 2.8703 2.9811 3.6566 3.8430 3.9047 3.5598 4.0199 3.9566 4.3252 4.0549 4.0495 4.0568 3.8663 4.1337 4.0298 1.0574 1.0074 1.0118 0.9952 1.0012 1.0026 1.0196 1.0063 0.9961 0.9983 0.9972
dispcorr: -0.019200546 hartree
energy: -2061.460024527331
dipole: -8.82601 7.34450 -1.48151 -4.88389 6.08723 1.20334 5.54285 -4.32939 1.21346
magnitude: 2.26173 au
magnitude: 5.74885 debye
