program: Orca
programVersion: 4.2.1
elementType: Cl Cl F F F F O N N N C C C C C C C C C C C C C H H H H H H H H H H H
charge: 0
multiplicity: 1
keywords: wb97x-d3
keywords: def2-TZVPP
keywords: def2/J RIJCOSX GRIDX6 NOFINALGRIDX
keywords: grid4 nofinalgrid
keywords: scfconv7
keywords: smallprint printgap noloewdin
keywords: NOSOSCF
formula: C13H11Cl2F4N3O
InChI: InChI=1S/C13H11Cl2F4N3O/c14-9-1-2-10(11(15)3-9)8(4-22-7-20-6-21-22)5-23-13(18,19)12(16)17/h1-3,6-8,12H,4-5H2
34 atoms
Cl -1.090034 0.894138 -2.868005
Cl -5.067036 2.580933 0.27553
F  3.226026 -0.325344 -1.354668
F  3.567237 1.392272 -0.09044
F  4.769633 -1.871785 0.344364
F  5.158787 -0.098809 1.560073
O  2.541915 -0.401121 0.774419
N  -0.806334 -2.112128 0.353327
N  -0.46104 -2.38532 1.613321
N  -2.625714 -2.845957 1.279947
C  0.350993 -0.014371 -0.308424
C  0.117281 -1.51207 -0.576799
C  1.27116 0.253599 0.88262
C  -0.97386 0.693322 -0.156066
C  -1.713537 1.108806 -1.263641
C  -1.561033 0.88735 1.092813
C  3.478719 0.042208 -0.066255
C  -2.965391 1.691716 -1.147605
C  -2.809368 1.466169 1.243469
C  -2.101041 -2.381819 0.171699
C  -3.503947 1.863838 0.115455
C  4.846953 -0.523595 0.316393
C  -1.581747 -2.824293 2.130013
H  0.838224 0.380019 -1.201709
H  -0.298671 -1.644828 -1.574364
H  1.052629 -2.068718 -0.547491
H  1.401987 1.328136 1.020863
H  0.867409 -0.151106 1.806643
H  -1.045301 0.577819 1.99124
H  -3.509514 2.001854 -2.028846
H  -3.229942 1.594983 2.230936
H  -2.606332 -2.234958 -0.770438
H  5.626885 -0.215527 -0.38181
H  -1.647088 -3.148193 3.157223
elementType: Cl F O N C H
totalener: -2061.43898763 hartree
nucrepener: 2349.46534103 hartree
electener: -4410.90432866 hartree
oneelecener: -7510.72502137 hartree
twoeener: 3099.82069270 hartree
cpcmener: -0.02547787 hartree
kineticenergy: 2055.84681663 hartree
xcener: -143.919770334358 hartree
chargesum: -0.0000000
charge: -0.078417 -0.081613 -0.208118 -0.197289 -0.197657 -0.197535 -0.307048 0.139231 -0.369817 -0.399432 0.086298 -0.113288 -0.043049 -0.014017 -0.010839 -0.175755 0.453235 -0.126946 -0.156928 0.062062 0.102371 0.292305 0.071149 0.077369 0.136010 0.125657 0.148176 0.118778 0.143569 0.125203 0.146739 0.166627 0.121663 0.161303
qa: -0.0784 -0.0816 -0.2081 -0.1973 -0.1977 -0.1975 -0.3070 0.1392 -0.3698 -0.3994 0.0863 -0.1133 -0.0430 -0.0140 -0.0108 -0.1758 0.4532 -0.1269 -0.1569 0.0621 0.1024 0.2923 0.0711 0.0774 0.1360 0.1257 0.1482 0.1188 0.1436 0.1252 0.1467 0.1666 0.1217 0.1613
va: 1.2515 1.2217 1.0850 1.1036 1.0879 1.0899 2.0836 3.3028 2.8482 3.0272 3.7064 3.8508 3.8854 3.5247 3.9917 3.9203 4.2885 4.0686 4.0745 4.0608 3.8682 4.1547 4.0324 1.0608 1.0054 1.0306 1.0020 1.0218 1.0045 1.0201 1.0048 0.9957 0.9835 0.9951
dispcorr: -0.019809043 hartree
energy: -2061.458796673647
dipole: -9.57466 10.06788 0.49321 -7.25558 8.12794 0.87237 6.47541 -7.33169 -0.85629
magnitude: 1.31815 au
magnitude: 3.35047 debye
