program: Orca
programVersion: 4.2.1
elementType: Cl Cl F F F F O N N N C C C C C C C C C C C C C H H H H H H H H H H H
charge: 0
multiplicity: 1
keywords: wb97x-d3
keywords: def2-TZVPP
keywords: def2/J RIJCOSX GRIDX6 NOFINALGRIDX
keywords: grid4 nofinalgrid
keywords: scfconv7
keywords: smallprint printgap noloewdin
keywords: NOSOSCF
formula: C13H11Cl2F4N3O
InChI: InChI=1S/C13H11Cl2F4N3O/c14-9-1-2-10(11(15)3-9)8(4-22-7-20-6-21-22)5-23-13(18,19)12(16)17/h1-3,6-8,12H,4-5H2
34 atoms
Cl -1.059795 0.245648 -2.644718
Cl -4.734796 3.18514 -0.116089
F  3.645614 0.704631 -1.430273
F  3.996072 1.529758 0.533756
F  4.596398 -1.741354 -0.58563
F  4.96613 -0.897333 1.395614
O  2.564257 -0.169321 0.31574
N  -0.977223 -2.259655 1.111889
N  -2.146132 -2.061793 1.723921
N  -2.244052 -3.880321 0.422074
C  0.179197 -0.307633 0.14539
C  0.132699 -1.348188 1.268075
C  1.37187 0.629144 0.296828
C  -1.068903 0.538632 0.063674
C  -1.687882 0.84952 -1.144949
C  -1.623811 1.094438 1.214214
C  3.702091 0.373409 -0.114195
C  -2.814177 1.656748 -1.215457
C  -2.741385 1.90806 1.178881
C  -1.050462 -3.344438 0.336619
C  -3.331908 2.177947 -0.044006
C  4.865966 -0.598184 0.082363
C  -2.872907 -3.057037 1.282813
H  0.30461 -0.850886 -0.793424
H  1.049562 -1.935425 1.26486
H  0.050735 -0.891659 2.253018
H  1.380123 1.33625 -0.534082
H  1.305543 1.19718 1.227031
H  -1.1769 0.891485 2.178146
H  -3.272909 1.875391 -2.169605
H  -3.142932 2.319878 2.094077
H  -0.220612 -3.70317 -0.252798
H  5.810334 -0.181444 -0.271869
H  -3.895406 -3.197716 1.597081
elementType: Cl F O N C H
totalener: -2061.44170510 hartree
nucrepener: 2303.53432841 hartree
electener: -4364.97603352 hartree
oneelecener: -7418.82322669 hartree
twoeener: 3053.84719318 hartree
cpcmener: -0.02750359 hartree
kineticenergy: 2055.85146104 hartree
xcener: -143.916466524000 hartree
chargesum: 0.0000000
charge: -0.079329 -0.083910 -0.200115 -0.199533 -0.199341 -0.198883 -0.295269 0.117287 -0.345041 -0.413776 0.040915 -0.111327 -0.014574 0.039544 -0.001518 -0.182170 0.429485 -0.124783 -0.152897 0.059617 0.091102 0.292466 0.065369 0.078643 0.130841 0.126683 0.120331 0.130822 0.137897 0.123764 0.145816 0.181192 0.128795 0.161899
qa: -0.0793 -0.0839 -0.2001 -0.1995 -0.1993 -0.1989 -0.2953 0.1173 -0.3450 -0.4138 0.0409 -0.1113 -0.0146 0.0395 -0.0015 -0.1822 0.4295 -0.1248 -0.1529 0.0596 0.0911 0.2925 0.0654 0.0786 0.1308 0.1267 0.1203 0.1308 0.1379 0.1238 0.1458 0.1812 0.1288 0.1619
va: 1.2449 1.2193 1.0972 1.1003 1.0872 1.0888 2.0964 3.3574 2.8731 3.0291 3.8221 3.8756 3.8845 3.4834 3.9924 3.9686 4.3738 4.0420 4.0437 4.0494 3.8678 4.1305 4.0403 1.0559 1.0183 1.0081 1.0091 0.9983 1.0091 1.0198 1.0042 0.9900 0.9835 0.9946
dispcorr: -0.017895574 hartree
energy: -2061.459600679056
dipole: -9.87260 11.37842 1.50582 -7.22463 8.26909 1.04447 10.01401 -9.53881 0.47520
magnitude: 1.89320 au
magnitude: 4.81214 debye
