program: Gaussian 09
title: 000030813
version: EM64L-G09RevD.01
frameworkgroup: C1[X(C19H21ClN2O2)]
method: RPBEPBE
basis: SDD
operation: Freq
keyword: #p
keyword: freq=noraman
keyword: PBEPBE/SDD
title: #p freq=noraman PBEPBE/SDD
converged: YES YES NO NO
title: Mulliken charges:
elementType: Cl O O N N C C C C C C C C C C C C C C C C C C C H H H H H H H H H H H H H H H H H H H H H
charge: -0.069746 -0.225115 -0.236067 -0.061715 -0.281823 -0.118796 -0.478909 -0.404906 -0.378702 -0.628908 0.360413 0.127593 -0.415095 -0.340610 -0.359983 -0.224135 -0.224478 -0.233204 0.346214 -0.314182 -0.360512 -0.212515 -0.186402 -0.115505 0.304392 0.238154 0.243321 0.189858 0.248740 0.230919 0.184745 0.226220 0.230056 0.185056 0.247584 0.243686 0.260823 0.264797 0.235809 0.236303 0.236969 0.255789 0.266168 0.251179 0.256521
chargesum: 0.00000
title: Mulliken charges with hydrogens summed into heavy atoms:
elementType: Cl O O N N C C C C C C C C C C C C C C C C C C C
charge: -0.069746 -0.225115 -0.236067 -0.061715 -0.281823 0.185596 0.002565 0.033693 0.036962 0.012423 0.360413 0.127593 0.076176 -0.079787 -0.095185 0.011674 0.011825 0.003765 0.346214 -0.058393 -0.094344 0.038664 0.070119 -0.115505
polarizability: 2.94310738e+02 -8.55025492e+00 2.41164405e+02 -1.18881146e+00 1.23552877e+00 1.61351139e+02
1716.lowfreq: -1.1876 0.0011 0.0015 0.0019 4.8633 11.0755 14.8255 21.9274 27.4100
frequency: 14.4466 21.8422 26.9037 34.4967 45.1051 50.6074 61.6374 84.9926 93.6528 127.4910 130.4306 144.3755 153.8611 176.4254 228.3235 240.6094 241.1341 261.8142 297.7777 305.0157 315.8392 353.7225 357.9565 389.1577 414.1245 416.5743 455.3155 473.9912 486.0611 499.5050 522.4196 579.4792 580.7720 597.0556 619.2183 624.3262 646.8275 676.3812 697.8033 709.5161 754.4150 774.5774 801.4893 814.1718 820.4985 826.3312 851.1640 857.7632 878.8732 926.2250 932.3859 946.8637 956.1406 972.8191 981.4185 983.1987 989.8803 990.7594 995.1065 999.8626 1011.7926 1023.7970 1042.3445 1071.0503 1071.8301 1075.3389 1085.3748 1094.4342 1109.1308 1114.3306 1161.2291 1173.3324 1174.7516 1176.7568 1178.9663 1199.7913 1215.3781 1222.6215 1223.2992 1243.1768 1252.1947 1259.3616 1285.2108 1290.3538 1305.8562 1318.1643 1335.6968 1346.7519 1357.5720 1371.1009 1376.5633 1384.1328 1405.8558 1432.8521 1434.3576 1450.1962 1465.8997 1472.7673 1476.6249 1478.3096 1480.3397 1481.4427 1496.4433 1583.2207 1586.4082 1599.7131 1605.6657 1624.5620 2837.5697 2843.7632 2860.1999 2951.9786 3010.2874 3020.2088 3022.4001 3032.0565 3044.5554 3064.1139 3077.2116 3089.7250 3129.7253 3135.1534 3147.0933 3155.1264 3155.5402 3161.6865 3169.7380 3174.3598 3181.4703
redmass: 4.9481 4.1653 4.3709 5.0969 3.2002 4.6680 6.4652 4.1051 4.0865 3.5406 4.1845 3.2163 3.4732 5.8850 4.7961 1.9210 1.5565 4.4350 3.4734 3.4104 7.1148 3.0230 5.7985 9.8465 2.9081 3.0180 3.7364 4.4456 4.1795 2.7325 3.3327 4.0142 3.7701 6.5919 6.2363 7.2112 5.1160 6.0367 3.4845 1.7821 4.0154 1.8444 1.3125 2.0159 4.3985 1.5141 2.5223 1.3838 2.6709 1.3440 1.3925 3.2963 1.3410 1.6035 1.5905 1.9168 5.2540 3.9727 1.8973 1.3102 4.8532 2.1075 2.5932 2.6498 2.4733 1.6326 2.2026 1.9845 1.3091 1.5361 1.8342 1.0580 1.1835 1.2867 1.2143 1.6178 1.0857 2.0845 3.0398 2.5174 2.6908 1.9104 1.3826 1.2653 1.3627 1.2956 1.4488 1.4769 2.0921 8.1248 2.6678 1.8166 3.8418 1.1901 2.1095 1.1603 1.0512 1.0713 2.1732 1.0925 1.4667 1.4479 1.1012 7.3612 6.2597 6.5839 6.6822 9.1751 1.0680 1.0643 1.0662 1.0554 1.1032 1.0718 1.0657 1.0830 1.0889 1.0889 1.1009 1.1019 1.0854 1.0882 1.0927 1.0878 1.0968 1.0886 1.1017 1.0966 1.0977
irintensity: 0.0484 0.0489 0.0481 0.3433 0.0511 0.6867 0.5126 0.1445 0.4831 0.3590 0.8337 7.8330 5.1299 2.1608 2.3752 1.8723 0.3323 3.0500 5.9411 6.0301 1.6885 0.6530 0.0346 20.0475 0.0866 0.0925 5.3119 1.8192 3.0627 22.9624 1.1052 2.7587 6.9202 7.2202 0.7723 1.9465 13.9230 57.1155 0.4665 93.4682 0.1925 16.5565 17.5085 6.8176 4.1913 68.1802 8.3285 0.7985 4.3993 0.0216 0.4942 13.7687 0.3651 0.4992 0.2366 1.1111 4.9530 32.4687 0.0934 0.0500 50.0576 14.0094 27.0810 37.3487 11.5964 7.7191 15.0115 18.0139 13.9393 11.1604 34.2843 0.1906 67.1196 5.8825 0.6947 77.7017 0.5615 147.0970 290.7767 9.1279 124.8806 43.6903 13.3097 0.4232 2.3486 2.5328 4.5603 1.1071 38.2768 1.0207 2.7861 27.6505 0.5985 1.3799 5.2144 78.8049 29.0577 6.7619 188.8741 1.7600 33.4928 31.8250 6.3475 13.4614 4.1184 91.8433 27.0242 208.2253 92.7165 49.9843 202.4871 52.7220 15.3173 50.7846 22.3958 53.4207 19.1751 8.1816 29.5477 31.0063 2.2032 1.0836 15.8786 11.1438 19.9928 1.9978 12.2060 7.8468 0.8982
temp: 298.150 k
press: 1.00000 atm
elementType: 17 8 8 7 7 6 6 6 6 6 6 6 6 6 6 6 6 6 6 6 6 6 6 6 1 1 1 1 1 1 1 1 1 1 1 1 1 1 1 1 1 1 1 1 1
symmnumber: 1
zpe: 945655.4 jmol-1
zpe.correction: 0.360181 hartree
zpe.thermalcorrener: 0.382893 hartree
zpe.thermalcorrenthalpy: 0.383837 hartree
zpe.thermalcorrgfe: 0.304054 hartree
zpe.sumelectzpe: -1454.843909 hartree
zpe.sumelectthermal: -1454.821197 hartree
zpe.sumelectthermalent: -1454.820253 hartree
zpe.sumelectthermalfe: -1454.900036 hartree
dipole: 4.4034 5.6129 0.4523
dipole: 7.1484
quadrupole: -161.1397 -147.5424 -142.5644
quadrupole: 8.2770 2.4260 -2.9274
quadrupole: -10.7242 2.8731 7.8511 8.2770 2.4260 -2.9274
hfenergy: -1455.20409 hartree
pointgroup: C01 [X(C19H21Cl1N2O2)]
dipole: -1.7655397 -2.1485309 -0.4197082 debye
polarizability: 293.9861744|-9.8286729|236.8042367|0.9241992|18.6871968|166.0358711 unknown
InChI: InChI=1S/C19H21ClN2O2/c1-21-12-11-17(13-21)22(16-5-3-2-4-6-16)19(23)14-24-18-9-7-15(20)8-10-18/h2-10,17H,11-14H2,1H3
charge 0 multiplicity 1
45 atoms
Cl 7.717809 -0.525623 0.293176
O  -0.449346 2.488821 0.152642
O  1.987275 1.353696 0.244655
N  -5.082612 1.272138 0.736427
N  -1.57344 0.458796 -0.167594
C  -2.895275 1.143085 -0.094757
C  -3.855451 0.881548 -1.301325
C  -3.751933 0.780169 1.14487
C  -5.27456 0.809159 -0.664987
C  -6.186871 0.958324 1.650734
C  -1.499459 -0.970908 -0.394272
C  -0.414265 1.242189 -0.02569
C  0.904953 0.447439 -0.108958
C  -1.579841 -1.876156 0.694286
C  -1.332216 -1.471257 -1.710207
C  -1.496969 -3.267959 0.465705
C  -1.248884 -2.86392 -1.935975
C  -1.33258 -3.764831 -0.848845
C  3.288112 0.828148 0.226274
C  3.62082 -0.50927 -0.107747
C  4.306649 1.749942 0.578621
C  4.975281 -0.918734 -0.086664
C  5.653328 1.341978 0.59963
C  5.970565 0.007846 0.265615
H  -2.651445 2.216198 -0.038131
H  -3.61259 -0.066845 -1.809783
H  -3.770639 1.694003 -2.041753
H  -3.743532 -0.326656 1.324179
H  -3.401113 1.288037 2.060203
H  -6.01269 1.44902 -1.180696
H  -5.655523 -0.243538 -0.697387
H  -7.120228 1.418673 1.27953
H  -5.978145 1.37783 2.650962
H  -6.367247 -0.141971 1.764592
H  0.876983 -0.418112 0.583523
H  1.044909 0.054454 -1.1377
H  -1.690975 -1.484046 1.710989
H  -1.268799 -0.765043 -2.545901
H  -1.556846 -3.96184 1.311221
H  -1.120806 -3.243011 -2.955701
H  -1.26872 -4.84427 -1.02378
H  2.854119 -1.239193 -0.382331
H  4.021664 2.7753 0.830568
H  5.242342 -1.948243 -0.342275
H  6.442392 2.049036 0.870854
