program: Orca
programVersion: 4.2.1
elementType: Cl Cl F F F F O N N N C C C C C C C C C C C C C H H H H H H H H H H H
charge: 0
multiplicity: 1
keywords: wb97x-d3
keywords: def2-TZVPP
keywords: def2/J RIJCOSX GRIDX6 NOFINALGRIDX
keywords: grid4 nofinalgrid
keywords: scfconv7
keywords: smallprint printgap noloewdin
keywords: NOSOSCF
formula: C13H11Cl2F4N3O
InChI: InChI=1S/C13H11Cl2F4N3O/c14-9-1-2-10(11(15)3-9)8(4-22-7-20-6-21-22)5-23-13(18,19)12(16)17/h1-3,6-8,12H,4-5H2
34 atoms
Cl -1.790903 -0.643478 -2.3183
Cl -4.598551 3.441144 -0.33027
F  4.221179 1.379522 -0.194308
F  3.795424 0.512412 1.736597
F  4.891932 -1.131656 -1.159626
F  4.48118 -1.969184 0.816061
O  2.618821 -0.166042 -0.036553
N  -0.917869 -2.060624 1.019151
N  -2.190739 -1.733498 1.244107
N  -2.041998 -3.84568 0.515813
C  0.244052 -0.14244 -0.010848
C  0.153471 -1.107989 1.176716
C  1.496404 0.720924 0.081273
C  -0.979319 0.734312 -0.113575
C  -1.936982 0.594014 -1.11417
C  -1.203283 1.729713 0.834916
C  3.809333 0.235066 0.406968
C  -3.05019 1.417738 -1.19276
C  -2.303729 2.566152 0.788197
C  -0.843489 -3.319221 0.580009
C  -3.219205 2.403337 -0.237457
C  4.85704 -0.849052 0.1603
C  -2.827376 -2.832542 0.929789
H  0.337756 -0.739915 -0.919812
H  1.077647 -1.676526 1.269436
H  0.002976 -0.570744 2.113581
H  1.511944 1.441358 -0.738804
H  1.535627 1.271704 1.023862
H  -0.50242 1.86316 1.649438
H  -3.773727 1.286356 -1.98526
H  -2.440617 3.329326 1.541549
H  0.089942 -3.80033 0.331015
H  5.849013 -0.543388 0.496629
H  -3.900582 -2.910756 1.011736
elementType: Cl F O N C H
totalener: -2061.44244350 hartree
nucrepener: 2314.02619849 hartree
electener: -4375.46864199 hartree
oneelecener: -7439.94812840 hartree
twoeener: 3064.47948640 hartree
cpcmener: -0.02875022 hartree
kineticenergy: 2055.85814793 hartree
xcener: -143.918368900545 hartree
chargesum: -0.0000000
charge: -0.082081 -0.085175 -0.198729 -0.203188 -0.196379 -0.198339 -0.296152 0.113088 -0.344107 -0.408656 0.117516 -0.106552 -0.059714 0.004168 0.005294 -0.164682 0.440984 -0.125343 -0.177277 0.061956 0.098941 0.288006 0.062931 0.077850 0.118238 0.127877 0.135609 0.122914 0.142881 0.122987 0.144692 0.175570 0.125467 0.159402
qa: -0.0821 -0.0852 -0.1987 -0.2032 -0.1964 -0.1983 -0.2962 0.1131 -0.3441 -0.4087 0.1175 -0.1066 -0.0597 0.0042 0.0053 -0.1647 0.4410 -0.1253 -0.1773 0.0620 0.0989 0.2880 0.0629 0.0778 0.1182 0.1279 0.1356 0.1229 0.1429 0.1230 0.1447 0.1756 0.1255 0.1594
va: 1.2405 1.2184 1.1017 1.0927 1.0907 1.0877 2.0895 3.3666 2.8668 3.0244 3.7194 3.8912 3.9146 3.4769 3.9565 3.9937 4.3372 4.0508 4.0548 4.0519 3.8617 4.1430 4.0441 1.0607 1.0234 1.0044 1.0023 1.0042 1.0011 1.0200 1.0055 0.9916 0.9826 0.9954
dispcorr: -0.018453655 hartree
energy: -2061.460897156339
dipole: -7.76430 9.54744 1.78313 -3.57193 4.84188 1.26995 7.88836 -7.08791 0.80044
magnitude: 2.33089 au
magnitude: 5.92465 debye
