program: Orca
programVersion: 4.2.1
elementType: Cl Cl F F F F O N N N C C C C C C C C C C C C C H H H H H H H H H H H
charge: 0
multiplicity: 1
keywords: wb97x-d3
keywords: def2-TZVPP
keywords: def2/J RIJCOSX GRIDX6 NOFINALGRIDX
keywords: grid4 nofinalgrid
keywords: scfconv7
keywords: smallprint printgap noloewdin
keywords: NOSOSCF
formula: C13H11Cl2F4N3O
InChI: InChI=1S/C13H11Cl2F4N3O/c14-9-1-2-10(11(15)3-9)8(4-22-7-20-6-21-22)5-23-13(18,19)12(16)17/h1-3,6-8,12H,4-5H2
34 atoms
Cl -1.445139 0.687241 -2.920268
Cl -4.908613 2.792495 0.564754
F  3.888217 1.404104 0.438359
F  3.766812 -0.130854 1.950881
F  4.861454 -0.416606 -1.370419
F  4.740318 -1.983862 0.146605
O  2.561933 -0.356822 0.083938
N  -0.91566 -2.157151 0.147896
N  -0.636474 -2.350825 1.436574
N  -2.762976 -2.899206 1.008341
C  0.29094 -0.081067 -0.504028
C  0.042405 -1.579376 -0.761222
C  1.324352 0.168856 0.58732
C  -1.002974 0.645593 -0.236896
C  -1.856856 1.029511 -1.270232
C  -1.422852 0.936093 1.059621
C  3.708033 0.068865 0.609579
C  -3.056082 1.685276 -1.041392
C  -2.613402 1.592108 1.323241
C  -2.187185 -2.478045 -0.09201
C  -3.421256 1.964942 0.263897
C  4.886399 -0.653751 -0.04025
C  -1.771715 -2.79825 1.911974
H  0.724832 0.316835 -1.425208
H  -0.347039 -1.724386 -1.767205
H  0.972037 -2.143595 -0.699503
H  1.405385 1.241245 0.776871
H  1.07653 -0.33665 1.521813
H  -0.812236 0.649802 1.904929
H  -3.68951 1.973705 -1.868525
H  -2.89914 1.805623 2.343784
H  -2.636522 -2.402698 -1.069429
H  5.843633 -0.329852 0.370633
H  -1.888122 -3.066596 2.950053
elementType: Cl F O N C H
totalener: -2061.44153236 hartree
nucrepener: 2326.65148189 hartree
electener: -4388.09301425 hartree
oneelecener: -7465.15908611 hartree
twoeener: 3077.06607186 hartree
cpcmener: -0.02511848 hartree
kineticenergy: 2055.86419636 hartree
xcener: -143.921626175911 hartree
chargesum: -0.0000000
charge: -0.078308 -0.083352 -0.200740 -0.199746 -0.198807 -0.198972 -0.284119 0.141547 -0.365255 -0.401265 0.120648 -0.143489 -0.071480 -0.003328 -0.026251 -0.165438 0.425481 -0.113250 -0.161939 0.070939 0.095984 0.289111 0.068688 0.082700 0.136848 0.130446 0.145643 0.121331 0.140532 0.125422 0.146026 0.166443 0.127604 0.160348
qa: -0.0783 -0.0834 -0.2007 -0.1997 -0.1988 -0.1990 -0.2841 0.1415 -0.3653 -0.4013 0.1206 -0.1435 -0.0715 -0.0033 -0.0263 -0.1654 0.4255 -0.1132 -0.1619 0.0709 0.0960 0.2891 0.0687 0.0827 0.1368 0.1304 0.1456 0.1213 0.1405 0.1254 0.1460 0.1664 0.1276 0.1603
va: 1.2503 1.2196 1.0966 1.0982 1.0873 1.0882 2.0985 3.3043 2.8440 3.0332 3.7069 3.8716 3.8710 3.5558 3.9870 3.9151 4.3732 4.0507 4.0719 4.0508 3.8732 4.1359 4.0356 1.0457 1.0027 1.0252 0.9990 1.0218 1.0092 1.0192 1.0048 0.9971 0.9833 0.9952
dispcorr: -0.018997102 hartree
energy: -2061.460529460840
dipole: -9.51342 10.26323 0.74981 -7.38144 8.11485 0.73341 4.93609 -5.30138 -0.36529
magnitude: 1.11065 au
magnitude: 2.82304 debye
