program: Orca
programVersion: 4.2.1
elementType: Cl Cl F F F F O N N N C C C C C C C C C C C C C H H H H H H H H H H H
charge: 0
multiplicity: 1
keywords: wb97x-d3
keywords: def2-TZVPP
keywords: def2/J RIJCOSX GRIDX6 NOFINALGRIDX
keywords: grid4 nofinalgrid
keywords: scfconv7
keywords: smallprint printgap noloewdin
keywords: NOSOSCF
formula: C13H11Cl2F4N3O
InChI: InChI=1S/C13H11Cl2F4N3O/c14-9-1-2-10(11(15)3-9)8(4-22-7-20-6-21-22)5-23-13(18,19)12(16)17/h1-3,6-8,12H,4-5H2
34 atoms
Cl -2.264535 -0.131913 -2.761061
Cl -3.514903 3.582129 0.849571
F  3.531431 -1.267807 0.201971
F  4.307101 0.112394 -1.263212
F  5.214671 0.533035 1.273459
F  3.167679 0.825431 1.980429
O  2.222026 0.394671 -0.515964
N  -0.917678 -2.376119 0.597818
N  -1.744888 -3.002129 -0.238774
N  -2.694571 -2.772579 1.775053
C  0.170878 -0.83973 -0.961152
C  0.360103 -1.879775 0.145917
C  1.497081 -0.341304 -1.51422
C  -0.749799 0.276349 -0.529631
C  -1.875277 0.648918 -1.263262
C  -0.515868 0.974425 0.655458
C  3.46377 0.026827 -0.203161
C  -2.731813 1.65688 -0.844373
C  -1.34673 1.988992 1.096031
C  -1.49624 -2.239213 1.791822
C  -2.454223 2.320663 0.334898
C  3.981798 0.942756 0.905389
C  -2.794756 -3.224002 0.510377
H  -0.283469 -1.367296 -1.801742
H  0.949632 -2.716428 -0.23024
H  0.875483 -1.480971 1.018059
H  2.074239 -1.186085 -1.895175
H  1.319143 0.33713 -2.348925
H  0.343238 0.730261 1.265162
H  -3.605292 1.920187 -1.423817
H  -1.129435 2.506523 2.019836
H  -1.014058 -1.757549 2.628138
H  4.02079 1.986259 0.58909
H  -3.668134 -3.731253 0.130366
elementType: Cl F O N C H
totalener: -2061.44190964 hartree
nucrepener: 2359.72976453 hartree
electener: -4421.17167417 hartree
oneelecener: -7531.00677445 hartree
twoeener: 3109.83510028 hartree
cpcmener: -0.02753409 hartree
kineticenergy: 2055.86168959 hartree
xcener: -143.920294961524 hartree
chargesum: 0.0000000
charge: -0.078986 -0.083778 -0.200589 -0.197912 -0.195926 -0.197544 -0.304985 0.119804 -0.346000 -0.409688 0.117582 -0.166443 -0.018074 0.041636 -0.012678 -0.211813 0.457905 -0.115621 -0.149001 0.072170 0.084706 0.281870 0.061598 0.085678 0.139438 0.116287 0.130470 0.121752 0.138452 0.121321 0.144508 0.172291 0.120956 0.160614
qa: -0.0790 -0.0838 -0.2006 -0.1979 -0.1959 -0.1975 -0.3050 0.1198 -0.3460 -0.4097 0.1176 -0.1664 -0.0181 0.0416 -0.0127 -0.2118 0.4579 -0.1156 -0.1490 0.0722 0.0847 0.2819 0.0616 0.0857 0.1394 0.1163 0.1305 0.1218 0.1385 0.1213 0.1445 0.1723 0.1210 0.1606
va: 1.2430 1.2203 1.0922 1.1034 1.0922 1.0823 2.0728 3.3596 2.8740 3.0279 3.6843 3.9207 3.8945 3.4980 3.9678 3.9815 4.3123 4.0328 4.0559 4.0457 3.8709 4.1183 4.0496 1.0645 1.0041 1.0150 1.0024 1.0079 1.0150 1.0209 1.0047 0.9936 0.9858 0.9954
dispcorr: -0.019722704 hartree
energy: -2061.461632348738
dipole: -7.48263 8.85778 1.37515 -9.50689 10.33821 0.83132 0.52426 -1.05056 -0.52630
magnitude: 1.69090 au
magnitude: 4.29792 debye
