program: Gaussian 09
title: 000030755
version: EM64L-G09RevD.01
frameworkgroup: C1[X(C13H18)]
method: RPBEPBE
basis: SDD
operation: Freq
keyword: #p
keyword: freq=noraman
keyword: PBEPBE/SDD
title: #p freq=noraman PBEPBE/SDD
converged: YES YES NO NO
title: Mulliken charges:
elementType: C C C C C C C C C C C C C H H H H H H H H H H H H H H H H H H
charge: -0.186404 -0.433322 0.157616 -0.448468 0.127328 -0.510790 0.323529 -0.738896 0.349594 -0.453426 -0.465806 -0.842884 -0.829851 0.215196 0.205148 0.198990 0.207013 0.208887 0.220489 0.216882 0.219178 0.215564 0.226530 0.226137 0.227906 0.230384 0.226820 0.227060 0.225222 0.224217 0.230155
chargesum: 0.00000
title: Mulliken charges with hydrogens summed into heavy atoms:
elementType: C C C C C C C C C C C C C
charge: 0.028792 -0.029184 0.157616 -0.032568 0.127328 -0.073419 0.323529 -0.077624 0.349594 -0.227289 -0.237900 -0.158619 -0.150257
polarizability: 1.59664834e+02 -2.32073956e+00 1.56660518e+02 2.68290687e+00 -1.08191432e+00 8.88097438e+01
1716.lowfreq: -14.7665 -7.2527 0.0001 0.0003 0.0004 7.1713 80.4080 100.2932 110.0971
frequency: 80.3798 100.2709 110.0783 147.7936 174.2771 183.7576 206.1064 257.6833 288.7923 297.4534 311.8379 342.7967 368.5538 437.0023 456.9865 487.3841 493.2495 523.8127 581.7999 603.8504 639.0749 720.9981 749.1547 814.5105 830.2232 835.6560 867.8721 896.7089 924.9760 944.2297 968.4907 985.6028 1000.0071 1028.9521 1037.7727 1040.3067 1044.7292 1076.6467 1102.6218 1127.1137 1166.9705 1173.0681 1182.5520 1210.8436 1256.2769 1258.3582 1268.2808 1299.4101 1318.9655 1332.9667 1348.4657 1354.1767 1371.8074 1382.1230 1397.4561 1400.6557 1412.5120 1456.2257 1459.8680 1467.0153 1469.6744 1470.8605 1472.9375 1474.6502 1479.6909 1483.8424 1494.9932 1587.8978 1608.1188 2942.4338 2964.8931 2968.2655 2971.8794 2978.3211 2985.0758 2990.3484 3007.0085 3030.1539 3036.1191 3046.0738 3046.9123 3072.7102 3078.2196 3079.3301 3084.1920 3110.1459 3135.7794
redmass: 2.5275 2.3852 1.4888 1.5463 1.1664 1.1770 2.1617 2.7702 2.1286 2.6592 2.8673 2.5520 2.6337 3.4073 4.4272 3.0710 3.1104 2.9189 3.5614 2.4100 3.1027 5.0055 3.2743 1.2481 2.2606 2.5765 1.6684 2.3750 2.2817 1.3326 1.7046 1.6043 1.4368 1.8275 1.6138 1.5447 1.8810 2.2164 1.8955 1.4197 1.4669 1.3211 1.9610 1.8123 2.0149 2.7312 1.2841 1.3737 1.7334 1.7454 1.4122 1.9709 2.0244 1.2492 1.2286 1.2734 2.9280 1.1623 1.1391 1.1063 1.4934 1.3003 1.1208 1.0755 1.1208 1.1180 1.0846 5.7084 7.2186 1.0661 1.0379 1.0663 1.0378 1.0383 1.0728 1.0700 1.0875 1.0995 1.0968 1.0967 1.1021 1.0984 1.0985 1.0977 1.0983 1.0867 1.0969
irintensity: 0.0161 0.3862 1.1579 0.1325 0.8623 0.0943 2.4482 0.1642 0.3889 0.6934 1.9373 3.9486 1.9035 0.6685 0.5042 0.1267 0.2820 0.8091 0.5461 2.4901 0.9942 0.2580 0.1087 29.4985 6.6706 1.3988 5.6083 3.8686 0.7988 0.1332 3.8355 9.1887 3.4058 1.1799 2.6735 11.3516 5.3985 6.2909 0.0758 1.1263 2.3396 4.1724 2.9673 4.5067 0.7111 0.1507 1.0396 0.4016 1.8109 1.7201 3.8600 0.1257 1.2194 12.2755 19.3544 1.7371 1.3692 11.6132 12.9114 13.1895 11.8163 17.9269 2.0372 2.0088 3.2558 38.7465 15.8149 0.8333 2.6475 32.3813 44.3400 16.6989 33.1727 37.0615 49.7516 40.1103 41.2276 56.8318 24.4245 5.3078 82.1532 49.1872 22.9518 35.9219 24.3761 14.1323 38.7618
temp: 298.150 k
press: 1.00000 atm
elementType: 6 6 6 6 6 6 6 6 6 6 6 6 6 1 1 1 1 1 1 1 1 1 1 1 1 1 1 1 1 1 1
symmnumber: 1
zpe: 715833.6 jmol-1
zpe.correction: 0.272647 hartree
zpe.thermalcorrener: 0.285411 hartree
zpe.thermalcorrenthalpy: 0.286355 hartree
zpe.thermalcorrgfe: 0.234705 hartree
zpe.sumelectzpe: -505.216416 hartree
zpe.sumelectthermal: -505.203652 hartree
zpe.sumelectthermalent: -505.202708 hartree
zpe.sumelectthermalfe: -505.254358 hartree
dipole: -0.5240 -0.5073 -0.1506
dipole: 0.7448
quadrupole: -75.9579 -74.8063 -82.4124
quadrupole: -1.1966 0.7828 -0.3167
quadrupole: 1.7676 2.9193 -4.6869 -1.1966 0.7828 -0.3167
hfenergy: -505.4890631 hartree
pointgroup: C01 [X(C13H18)]
dipole: 0.2376677 0.1639138 -0.0500662 debye
polarizability: 158.8949339|-2.6907561|157.3853706|-1.0422244|3.1995931|88.8547912 unknown
InChI: InChI=1S/C13H18/c1-9-7-8-11(3)13-10(2)5-4-6-12(9)13/h7-8,10H,4-6H2,1-3H3
charge 0 multiplicity 1
31 atoms
C  1.838559 -0.530179 -0.173971
C  2.440607 0.79999 -0.692441
C  0.304754 -0.479876 -0.12374
C  1.899371 1.99831 0.111181
C  -0.379665 0.766533 -0.007182
C  0.367364 2.101424 -0.039374
C  -0.441919 -1.69979 -0.184317
C  2.434225 -0.905972 1.215687
C  -1.806512 0.798991 0.079923
C  -1.851191 -1.647534 -0.090254
C  -2.524835 -0.416162 0.048176
C  0.229343 -3.051507 -0.385233
C  -2.560029 2.114495 0.193143
H  2.134988 -1.332489 -0.879238
H  2.179441 0.931941 -1.762152
H  3.545416 0.755543 -0.628497
H  2.369883 2.940393 -0.228931
H  2.167914 1.880525 1.178356
H  0.133993 2.598767 -1.006214
H  -0.038348 2.776219 0.739845
H  2.03199 -1.864511 1.587255
H  3.535117 -0.998847 1.152504
H  2.196055 -0.13846 1.973046
H  -2.4266 -2.580248 -0.134937
H  -3.61914 -0.397648 0.118833
H  -0.525622 -3.855456 -0.421563
H  0.79979 -3.088716 -1.333631
H  0.940382 -3.299377 0.424294
H  -2.300266 2.66214 1.120323
H  -2.3320 2.794504 -0.650344
H  -3.649864 1.942199 0.200951
