program: Orca
programVersion: 4.2.1
elementType: Cl Cl F F F F O N N N C C C C C C C C C C C C C H H H H H H H H H H H
charge: 0
multiplicity: 1
keywords: wb97x-d3
keywords: def2-TZVPP
keywords: def2/J RIJCOSX GRIDX6 NOFINALGRIDX
keywords: grid4 nofinalgrid
keywords: scfconv7
keywords: smallprint printgap noloewdin
keywords: NOSOSCF
formula: C13H11Cl2F4N3O
InChI: InChI=1S/C13H11Cl2F4N3O/c14-9-1-2-10(11(15)3-9)8(4-22-7-20-6-21-22)5-23-13(18,19)12(16)17/h1-3,6-8,12H,4-5H2
34 atoms
Cl -1.654058 -0.268318 -2.507626
Cl -4.78531 3.167236 0.115591
F  4.07867 1.475498 -0.064936
F  3.764949 0.487046 1.828236
F  4.89871 -0.893311 -1.189065
F  4.546551 -1.913577 0.710992
O  2.575507 -0.170262 0.056326
N  -1.00213 -2.193161 0.84446
N  -0.992585 -3.058055 -0.169699
N  -2.967819 -3.107263 0.879692
C  0.201059 -0.227835 0.009565
C  0.12092 -1.319313 1.082622
C  1.418575 0.664688 0.206746
C  -1.051334 0.613798 0.000157
C  -1.94045 0.656049 -1.071323
C  -1.374007 1.386599 1.115134
C  3.753932 0.279036 0.485468
C  -3.089811 1.433538 -1.045972
C  -2.509732 2.173905 1.170791
C  -2.187204 -2.225241 1.455754
C  -3.360918 2.189965 0.079058
C  4.85693 -0.723844 0.15059
C  -2.1883 -3.584603 -0.108681
H  0.313569 -0.723335 -0.95608
H  1.026827 -1.923555 1.088854
H  0.005594 -0.891133 2.078552
H  1.427776 1.448212 -0.552994
H  1.408624 1.139784 1.190488
H  -0.722192 1.379449 1.979958
H  -3.760303 1.445115 -1.893703
H  -2.722425 2.761579 2.052667
H  -2.426525 -1.606265 2.305507
H  5.833252 -0.394302 0.508633
H  -2.510159 -4.346534 -0.801123
elementType: Cl F O N C H
totalener: -2061.44300955 hartree
nucrepener: 2312.89474514 hartree
electener: -4374.33775469 hartree
oneelecener: -7437.61219581 hartree
twoeener: 3063.27444112 hartree
cpcmener: -0.02998665 hartree
kineticenergy: 2055.86784041 hartree
xcener: -143.920177350441 hartree
chargesum: 0.0000000
charge: -0.075048 -0.081754 -0.198770 -0.202906 -0.196629 -0.197622 -0.292805 0.118915 -0.347128 -0.407752 0.135875 -0.123216 -0.048376 -0.049697 0.033170 -0.177840 0.436778 -0.126714 -0.163810 0.063947 0.100001 0.289852 0.062982 0.074440 0.128838 0.125323 0.133057 0.122943 0.140285 0.123353 0.147125 0.169145 0.124724 0.159313
qa: -0.0750 -0.0818 -0.1988 -0.2029 -0.1966 -0.1976 -0.2928 0.1189 -0.3471 -0.4078 0.1359 -0.1232 -0.0484 -0.0497 0.0332 -0.1778 0.4368 -0.1267 -0.1638 0.0639 0.1000 0.2899 0.0630 0.0744 0.1288 0.1253 0.1331 0.1229 0.1403 0.1234 0.1471 0.1691 0.1247 0.1593
va: 1.2461 1.2216 1.1014 1.0935 1.0906 1.0889 2.0935 3.3472 2.8701 3.0259 3.6920 3.8933 3.9178 3.5095 3.9460 3.9754 4.3438 4.0633 4.0473 4.0529 3.8684 4.1429 4.0495 1.0706 1.0252 1.0008 1.0019 1.0026 1.0052 1.0209 1.0042 0.9961 0.9827 0.9960
dispcorr: -0.018543715 hartree
energy: -2061.461553264166
dipole: -9.16186 10.25980 1.09794 -4.56043 6.24425 1.68382 8.47219 -6.96287 1.50932
magnitude: 2.51371 au
magnitude: 6.38935 debye
