program: Orca
programVersion: 4.2.1
elementType: Cl Cl F F F F O N N N C C C C C C C C C C C C C H H H H H H H H H H H
charge: 0
multiplicity: 1
keywords: wb97x-d3
keywords: def2-TZVPP
keywords: def2/J RIJCOSX GRIDX6 NOFINALGRIDX
keywords: grid4 nofinalgrid
keywords: scfconv7
keywords: smallprint printgap noloewdin
keywords: NOSOSCF
formula: C13H11Cl2F4N3O
InChI: InChI=1S/C13H11Cl2F4N3O/c14-9-1-2-10(11(15)3-9)8(4-22-7-20-6-21-22)5-23-13(18,19)12(16)17/h1-3,6-8,12H,4-5H2
34 atoms
Cl -1.40697 1.154885 -3.006086
Cl -5.042412 2.744079 0.572501
F  3.826829 0.624647 1.60574
F  3.197052 -1.44072 1.64527
F  5.162246 0.190448 -0.758315
F  4.491976 -1.889295 -0.74885
O  2.540782 -0.142828 -0.04983
N  -0.685567 -2.040241 0.092473
N  -2.01734 -2.117936 0.072992
N  -1.205737 -3.128504 1.897469
C  0.267491 0.147002 -0.634134
C  0.037868 -1.34188 -0.943631
C  1.30231 0.37276 0.459351
C  -1.036283 0.839442 -0.329845
C  -1.873295 1.305503 -1.342756
C  -1.496429 0.984323 0.976382
C  3.525754 -0.423316 0.801243
C  -3.100408 1.893317 -1.082285
C  -2.717524 1.565695 1.271922
C  -0.215144 -2.646982 1.186811
C  -3.512044 2.016398 0.233257
C  4.786163 -0.831899 0.03952
C  -2.284705 -2.778826 1.16951
H  0.687804 0.576979 -1.547018
H  -0.536028 -1.444547 -1.862125
H  0.988834 -1.847906 -1.105341
H  1.405353 1.44079 0.659684
H  1.035565 -0.1235 1.394996
H  -0.89833 0.630993 1.806053
H  -3.72239 2.245947 -1.893197
H  -3.040574 1.657228 2.29954
H  0.836556 -2.722723 1.415208
H  5.604399 -1.092675 0.712466
H  -3.296488 -3.021783 1.455098
elementType: Cl F O N C H
totalener: -2061.44135274 hartree
nucrepener: 2334.21889886 hartree
electener: -4395.66025160 hartree
oneelecener: -7479.96207063 hartree
twoeener: 3084.30181903 hartree
cpcmener: -0.02622940 hartree
kineticenergy: 2055.84438105 hartree
xcener: -143.917263109005 hartree
chargesum: 0.0000000
charge: -0.081696 -0.084912 -0.196868 -0.204798 -0.196314 -0.197787 -0.287434 0.111486 -0.337288 -0.404915 0.145424 -0.118888 -0.129292 0.004173 -0.016234 -0.146539 0.450563 -0.136652 -0.176993 0.048123 0.106370 0.288283 0.066148 0.083999 0.131350 0.136267 0.154271 0.119432 0.139048 0.125241 0.145562 0.174801 0.125191 0.160875
qa: -0.0817 -0.0849 -0.1969 -0.2048 -0.1963 -0.1978 -0.2874 0.1115 -0.3373 -0.4049 0.1454 -0.1189 -0.1293 0.0042 -0.0162 -0.1465 0.4506 -0.1367 -0.1770 0.0481 0.1064 0.2883 0.0661 0.0840 0.1313 0.1363 0.1543 0.1194 0.1390 0.1252 0.1456 0.1748 0.1252 0.1609
va: 1.2471 1.2184 1.1062 1.0882 1.0914 1.0886 2.0845 3.3501 2.8698 3.0407 3.7183 3.8444 3.9497 3.5235 4.0168 3.9102 4.3068 4.0763 4.0746 4.0466 3.8648 4.1475 4.0335 1.0419 1.0201 1.0195 1.0024 0.9969 1.0015 1.0197 1.0053 1.0067 0.9828 0.9957
dispcorr: -0.019413681 hartree
energy: -2061.460766419023
dipole: -7.62905 8.94142 1.31237 -6.37086 6.91924 0.54838 4.79047 -4.61262 0.17784
magnitude: 1.43341 au
magnitude: 3.64343 debye
