program: Orca
programVersion: 4.2.1
elementType: Cl Cl F F F F O N N N C C C C C C C C C C C C C H H H H H H H H H H H
charge: 0
multiplicity: 1
keywords: wb97x-d3
keywords: def2-TZVPP
keywords: def2/J RIJCOSX GRIDX6 NOFINALGRIDX
keywords: grid4 nofinalgrid
keywords: scfconv7
keywords: smallprint printgap noloewdin
keywords: NOSOSCF
formula: C13H11Cl2F4N3O
InChI: InChI=1S/C13H11Cl2F4N3O/c14-9-1-2-10(11(15)3-9)8(4-22-7-20-6-21-22)5-23-13(18,19)12(16)17/h1-3,6-8,12H,4-5H2
34 atoms
Cl -1.713599 0.585599 -3.03796
Cl -3.344127 3.320157 1.255379
F  3.664753 -1.026613 0.981859
F  4.119416 -0.59794 -1.08349
F  5.176005 1.216098 0.604063
F  3.216275 1.614601 1.4829
O  2.081476 -0.12258 -0.311468
N  -1.555814 -2.622113 -0.070101
N  -0.972028 -3.097145 1.031641
N  -3.149573 -2.733116 1.397326
C  0.059147 -1.05292 -1.135775
C  -0.803419 -2.32127 -1.262574
C  1.347803 -1.352692 -0.388139
C  -0.751506 0.075034 -0.545068
C  -1.603983 0.85254 -1.326824
C  -0.742034 0.34104 0.82228
C  3.383787 -0.166225 -0.024146
C  -2.403102 1.851548 -0.792058
C  -1.52922 1.327698 1.389042
C  -2.851194 -2.401374 0.164563
C  -2.354807 2.079535 0.571364
C  3.849811 1.241345 0.348462
C  -1.965263 -3.150509 1.883605
H  0.345629 -0.791155 -2.157263
H  -1.520441 -2.197824 -2.072161
H  -0.184499 -3.182751 -1.514992
H  1.169278 -1.742285 0.614527
H  1.903467 -2.108697 -0.947876
H  -0.109507 -0.235499 1.483111
H  -3.05062 2.43635 -1.430492
H  -1.494303 1.502935 2.455225
H  -3.525981 -2.012501 -0.582366
H  3.642342 1.965309 -0.440457
H  -1.831677 -3.506698 2.893362
elementType: Cl F O N C H
totalener: -2061.44199969 hartree
nucrepener: 2356.44436111 hartree
electener: -4417.88636080 hartree
oneelecener: -7524.66415537 hartree
twoeener: 3106.77779457 hartree
cpcmener: -0.02701513 hartree
kineticenergy: 2055.85287762 hartree
xcener: -143.919766352925 hartree
chargesum: -0.0000000
charge: -0.080505 -0.083718 -0.195920 -0.202010 -0.198243 -0.198707 -0.290040 0.142895 -0.372085 -0.399911 0.089305 -0.149400 -0.054509 0.030870 -0.024463 -0.162669 0.439030 -0.115994 -0.159080 0.064232 0.093402 0.287829 0.074611 0.084627 0.134896 0.130911 0.124286 0.135090 0.137084 0.123733 0.145169 0.167081 0.120063 0.162139
qa: -0.0805 -0.0837 -0.1959 -0.2020 -0.1982 -0.1987 -0.2900 0.1429 -0.3721 -0.3999 0.0893 -0.1494 -0.0545 0.0309 -0.0245 -0.1627 0.4390 -0.1160 -0.1591 0.0642 0.0934 0.2878 0.0746 0.0846 0.1349 0.1309 0.1243 0.1351 0.1371 0.1237 0.1452 0.1671 0.1201 0.1621
va: 1.2495 1.2195 1.1051 1.0939 1.0887 1.0848 2.0734 3.3022 2.8454 3.0295 3.8067 3.9222 3.8733 3.4862 3.9655 3.9011 4.3501 4.0532 4.0770 4.0577 3.8718 4.1258 4.0283 1.0396 1.0040 1.0094 1.0223 1.0030 1.0060 1.0200 1.0047 0.9959 0.9852 0.9944
dispcorr: -0.019412602 hartree
energy: -2061.461412287664
dipole: -12.57540 12.38035 -0.19505 -15.65934 15.36910 -0.29024 -1.00427 -0.77359 -1.77786
magnitude: 1.81193 au
magnitude: 4.60555 debye
