program: Orca
programVersion: 4.2.1
elementType: Cl Cl F F F F O N N N C C C C C C C C C C C C C H H H H H H H H H H H
charge: 0
multiplicity: 1
keywords: wb97x-d3
keywords: def2-TZVPP
keywords: def2/J RIJCOSX GRIDX6 NOFINALGRIDX
keywords: grid4 nofinalgrid
keywords: scfconv7
keywords: smallprint printgap noloewdin
keywords: NOSOSCF
formula: C13H11Cl2F4N3O
InChI: InChI=1S/C13H11Cl2F4N3O/c14-9-1-2-10(11(15)3-9)8(4-22-7-20-6-21-22)5-23-13(18,19)12(16)17/h1-3,6-8,12H,4-5H2
34 atoms
Cl -1.501622 -0.25221 -2.455596
Cl -4.81334 3.009309 0.171672
F  3.593208 0.483813 -1.536559
F  4.087088 1.643644 0.215956
F  4.646919 -1.778435 -0.313039
F  5.183612 -0.551143 1.41345
O  2.674988 -0.074154 0.418018
N  -0.966884 -2.16291 0.861638
N  -2.115873 -1.936845 1.500709
N  -2.366198 -3.578834 0.000159
C  0.29822 -0.192266 0.095841
C  0.204619 -1.351741 1.097167
C  1.479718 0.720194 0.4024
C  -0.976483 0.613736 0.076393
C  -1.847157 0.641134 -1.009651
C  -1.350048 1.348937 1.199918
C  3.763799 0.390279 -0.191666
C  -3.027785 1.369979 -0.992642
C  -2.515479 2.090782 1.247861
C  -1.13151 -3.139396 -0.034209
C  -3.347868 2.093063 0.141375
C  4.95735 -0.524549 0.081551
C  -2.923717 -2.809963 0.955858
H  0.470402 -0.622343 -0.892365
H  1.081566 -1.992106 1.017736
H  0.15319 -0.991124 2.124102
H  1.525386 1.512801 -0.346298
H  1.385013 1.191238 1.382368
H  -0.718734 1.341386 2.079484
H  -3.684036 1.369663 -1.851725
H  -2.768741 2.650649 2.137196
H  -0.334889 -3.492897 -0.670334
H  5.857627 -0.190196 -0.435754
H  -3.954783 -2.898203 1.261423
elementType: Cl F O N C H
totalener: -2061.44066849 hartree
nucrepener: 2320.46712915 hartree
electener: -4381.90779764 hartree
oneelecener: -7452.82620169 hartree
twoeener: 3070.91840405 hartree
cpcmener: -0.02836127 hartree
kineticenergy: 2055.85758891 hartree
xcener: -143.917922565708 hartree
chargesum: -0.0000000
charge: -0.081782 -0.084050 -0.202182 -0.199427 -0.198719 -0.197929 -0.298852 0.114283 -0.334725 -0.405038 0.079145 -0.097480 -0.041656 0.008086 0.010772 -0.173086 0.435779 -0.123726 -0.167717 0.045121 0.098056 0.288555 0.058414 0.075753 0.130435 0.124511 0.129065 0.133410 0.137722 0.123500 0.146590 0.179484 0.127286 0.160405
qa: -0.0818 -0.0841 -0.2022 -0.1994 -0.1987 -0.1979 -0.2989 0.1143 -0.3347 -0.4050 0.0791 -0.0975 -0.0417 0.0081 0.0108 -0.1731 0.4358 -0.1237 -0.1677 0.0451 0.0981 0.2886 0.0584 0.0758 0.1304 0.1245 0.1291 0.1334 0.1377 0.1235 0.1466 0.1795 0.1273 0.1604
va: 1.2401 1.2193 1.0938 1.1015 1.0878 1.0895 2.0888 3.3597 2.8784 3.0240 3.7938 3.8606 3.8923 3.4771 3.9436 3.9795 4.3672 4.0583 4.0569 4.0550 3.8662 4.1362 4.0458 1.0608 1.0179 1.0110 1.0065 0.9998 1.0058 1.0198 1.0041 0.9917 0.9831 0.9961
dispcorr: -0.018768665 hartree
energy: -2061.459437153515
dipole: -8.63592 10.29900 1.66309 -5.52590 6.59408 1.06818 8.76378 -8.37759 0.38618
magnitude: 2.01395 au
magnitude: 5.11906 debye
