program: Orca
programVersion: 4.2.1
elementType: Cl Cl F F F F O N N N C C C C C C C C C C C C C H H H H H H H H H H H
charge: 0
multiplicity: 1
keywords: wb97x-d3
keywords: def2-TZVPP
keywords: def2/J RIJCOSX GRIDX6 NOFINALGRIDX
keywords: grid4 nofinalgrid
keywords: scfconv7
keywords: smallprint printgap noloewdin
keywords: NOSOSCF
formula: C13H11Cl2F4N3O
InChI: InChI=1S/C13H11Cl2F4N3O/c14-9-1-2-10(11(15)3-9)8(4-22-7-20-6-21-22)5-23-13(18,19)12(16)17/h1-3,6-8,12H,4-5H2
34 atoms
Cl -1.605862 -0.368355 -2.487147
Cl -4.725299 3.269488 -0.133558
F  4.097231 1.385071 -0.366775
F  3.855972 0.75362 1.683155
F  4.8192 -1.169408 -1.086331
F  4.547714 -1.821573 0.981524
O  2.574715 -0.177591 0.107741
N  -0.998119 -2.136039 0.980054
N  -0.87474 -3.148764 0.121015
N  -2.959134 -3.060672 0.930852
C  0.202463 -0.206801 0.058033
C  0.094258 -1.220148 1.202917
C  1.430502 0.681157 0.206555
C  -1.036559 0.651069 -0.024849
C  -1.903367 0.646573 -1.115588
C  -1.366749 1.492731 1.036978
C  3.778528 0.312621 0.401093
C  -3.037711 1.445156 -1.160058
C  -2.48928 2.300464 1.023801
C  -2.246884 -2.088804 1.44908
C  -3.3178 2.268815 -0.085326
C  4.847901 -0.760346 0.200825
C  -2.072058 -3.675751 0.125287
H  0.319309 -0.769573 -0.869861
H  1.008033 -1.805706 1.289478
H  -0.067347 -0.724466 2.1602
H  1.447541 1.421035 -0.595646
H  1.427011 1.209129 1.162791
H  -0.732317 1.524414 1.914349
H  -3.690279 1.420282 -2.021697
H  -2.710017 2.939963 1.866924
H  -2.581895 -1.349442 2.159936
H  5.846195 -0.395239 0.446723
H  -2.313629 -4.543276 -0.469071
elementType: Cl F O N C H
totalener: -2061.44313426 hartree
nucrepener: 2310.06241280 hartree
electener: -4371.50554706 hartree
oneelecener: -7431.90580916 hartree
twoeener: 3060.40026210 hartree
cpcmener: -0.03002650 hartree
kineticenergy: 2055.85309764 hartree
xcener: -143.917322014473 hartree
chargesum: -0.0000000
charge: -0.075043 -0.081259 -0.199439 -0.201592 -0.196650 -0.197761 -0.290660 0.121744 -0.345565 -0.407680 0.129528 -0.124412 -0.045077 -0.063323 0.043421 -0.177244 0.435380 -0.128086 -0.161980 0.060362 0.100699 0.288194 0.063770 0.073672 0.126444 0.130322 0.132192 0.123766 0.140757 0.123523 0.147200 0.168745 0.126111 0.159940
qa: -0.0750 -0.0813 -0.1994 -0.2016 -0.1967 -0.1978 -0.2907 0.1217 -0.3456 -0.4077 0.1295 -0.1244 -0.0451 -0.0633 0.0434 -0.1772 0.4354 -0.1281 -0.1620 0.0604 0.1007 0.2882 0.0638 0.0737 0.1264 0.1303 0.1322 0.1238 0.1408 0.1235 0.1472 0.1687 0.1261 0.1599
va: 1.2470 1.2221 1.0998 1.0959 1.0905 1.0889 2.0955 3.3428 2.8788 3.0246 3.7037 3.8857 3.9186 3.5071 3.9403 3.9736 4.3487 4.0632 4.0451 4.0594 3.8681 4.1398 4.0499 1.0718 1.0287 0.9997 1.0019 1.0015 1.0056 1.0207 1.0040 0.9956 0.9826 0.9956
dispcorr: -0.018458172 hartree
energy: -2061.461592434957
dipole: -9.35879 10.36871 1.00992 -4.03194 5.89468 1.86274 8.93919 -7.55489 1.38431
magnitude: 2.53102 au
magnitude: 6.43333 debye
