program: Gaussian 09
title: 000030801
version: EM64L-G09RevD.01
frameworkgroup: C1[X(C14H10I2O2)]
method: RPBEPBE
basis: SDD
operation: Freq
keyword: #p
keyword: freq=noraman
keyword: PBEPBE/SDD
title: #p freq=noraman PBEPBE/SDD
converged: YES YES NO NO
title: Mulliken charges:
elementType: I I O O C C C C C C C C C C C C C C H H H H H H H H H H
charge: 0.103054 0.106494 -0.406984 -0.233617 -0.487625 0.474969 0.500254 -0.404351 -0.423289 -0.376186 -0.336626 0.174457 -0.157895 -0.151451 -0.167734 -0.154763 -0.361452 -0.363615 0.258852 0.236777 0.240499 0.288238 0.258293 0.250148 0.251476 0.250251 0.250058 0.381767
chargesum: 0.00000
title: Mulliken charges with hydrogens summed into heavy atoms:
elementType: I I O O C C C C C C C C C C C C C C
charge: 0.103054 0.106494 -0.025216 -0.233617 -0.228773 0.474969 0.500254 -0.167574 -0.182790 -0.087948 -0.078333 0.174457 0.092253 0.100025 0.082517 0.095295 -0.361452 -0.363615
polarizability: 2.89479620e+02 -4.33661384e+00 1.68891191e+02 -1.35095275e+01 1.00018318e+01 1.52376736e+02
1716.lowfreq: -7.3669 -4.6660 -2.6627 -0.0002 0.0001 0.0006 12.3978 20.4024 34.3180
frequency: 12.1125 20.2559 34.3096 38.7884 58.8839 91.5159 108.6659 115.7497 149.4144 181.5254 218.7905 239.0067 291.0615 306.2236 328.7789 345.4790 369.6532 401.8476 404.0373 491.8302 506.8315 552.0706 594.1790 619.8547 623.8895 646.9253 679.7654 702.5337 721.4964 727.0013 802.0419 817.9577 828.8587 837.9764 851.7643 863.1774 918.2978 954.5412 961.3601 966.1178 987.8590 990.1254 992.1495 1048.2097 1055.9232 1059.0475 1110.8925 1118.7788 1176.1559 1190.3751 1195.9866 1198.9912 1230.6937 1250.2568 1300.0892 1304.6651 1338.0278 1372.6748 1373.9021 1393.2124 1397.8697 1465.7149 1469.0860 1573.0282 1576.4544 1587.7098 1593.7230 1657.9191 3054.1728 3128.8029 3130.3678 3147.9752 3149.5947 3165.9870 3168.1507 3169.9447 3172.4773 3503.0057
redmass: 11.5641 4.6345 5.0075 5.3449 9.4776 8.9272 8.7140 10.4404 9.5051 10.5481 6.6962 8.1992 6.2674 4.7896 6.0096 5.9166 7.4127 2.8246 2.9006 3.1047 3.4333 3.1187 3.8716 6.6922 6.7502 1.7095 6.3500 3.7038 4.2100 3.7718 2.2989 1.7592 1.2566 1.5581 2.1849 2.6598 3.6742 1.4374 1.4345 1.3910 1.4993 5.0302 4.4043 2.5641 2.5702 2.4713 1.4476 1.4164 2.6998 1.5088 1.5278 1.1345 1.4504 1.5852 1.2897 1.3432 2.5827 5.5142 4.9177 2.2754 2.1718 2.2627 2.2994 7.1922 7.0336 6.0126 5.9560 8.1599 1.0845 1.0897 1.0899 1.0891 1.0885 1.0954 1.0953 1.0968 1.0969 1.0639
irintensity: 0.0294 0.3091 1.4978 1.3557 0.5143 0.4831 0.3426 0.3174 0.0476 0.0072 0.9275 2.4513 0.6367 0.6697 3.2134 3.1765 12.7181 0.1806 0.0954 16.2116 17.8499 58.8920 74.2793 1.7157 4.3538 71.7652 14.5133 41.0098 9.7727 25.9543 65.2836 73.8203 0.1188 2.0958 17.1429 2.7916 6.0117 2.3274 2.2811 0.5887 7.0541 112.8836 42.1919 343.5578 15.8519 7.3706 3.3479 13.8001 1.6927 1.0259 6.5687 0.8495 3.2918 3.5368 1.8176 2.9719 54.5544 9.0986 7.9921 18.9977 11.7933 129.9775 60.4420 1.2327 1.3700 12.5911 10.1709 153.2750 4.8072 7.3214 8.3471 1.6404 2.2934 7.0630 9.3823 0.8730 0.2029 32.1150
temp: 298.150 k
press: 1.00000 atm
elementType: 53 53 8 8 6 6 6 6 6 6 6 6 6 6 6 6 6 6 1 1 1 1 1 1 1 1 1 1
symmnumber: 1
zpe: 521479.5 jmol-1
zpe.correction: 0.198621 hartree
zpe.thermalcorrener: 0.215513 hartree
zpe.thermalcorrenthalpy: 0.216457 hartree
zpe.thermalcorrgfe: 0.147336 hartree
zpe.sumelectzpe: -711.696210 hartree
zpe.sumelectthermal: -711.679318 hartree
zpe.sumelectthermalent: -711.678374 hartree
zpe.sumelectthermalfe: -711.747495 hartree
dipole: -0.3724 1.9798 1.4961
dipole: 2.5093
quadrupole: -144.0204 -125.9789 -127.0667
quadrupole: -2.3869 -2.7537 3.8610
quadrupole: -11.6651 6.3765 5.2887 -2.3869 -2.7537 3.8610
hfenergy: -711.894831 hartree
pointgroup: C01 [X(C14H10I2O2)]
dipole: -0.1190256 -0.7379456 -0.6449053 debye
polarizability: 289.1973828|9.5491669|167.9015135|11.2827075|11.6861107|153.6486501 unknown
InChI: InChI=1S/C14H10I2O2/c15-11-5-1-9(2-6-11)13(14(17)18)10-3-7-12(16)8-4-10/h1-8,13,17H
charge 0 multiplicity 1
28 atoms
I  5.364607 2.612583 0.25215
I  -5.44262 2.135568 0.472071
O  -0.136473 -3.553174 -0.504744
O  0.150249 -2.524992 1.553357
C  0.0998 -1.157279 -0.534597
C  1.363734 -0.31477 -0.302409
C  -1.200485 -0.36548 -0.283174
C  1.855148 0.455846 -1.386269
C  -2.202243 -0.328938 -1.281988
C  2.033582 -0.237836 0.943772
C  -1.422963 0.317352 0.937625
C  0.05998 -2.432757 0.309617
C  2.985675 1.288943 -1.24092
C  -3.407558 0.381425 -1.078216
C  3.16971 0.588612 1.103663
C  -2.623114 1.027582 1.158503
C  3.636212 1.34855 0.010873
C  -3.607161 1.055207 0.145168
H  0.090928 -1.48621 -1.587161
H  1.350121 0.414073 -2.358762
H  -2.051303 -0.86003 -2.22927
H  1.681779 -0.832879 1.792421
H  -0.662576 0.29713 1.724679
H  3.349273 1.875457 -2.08947
H  -4.171397 0.403123 -1.860381
H  3.678614 0.632715 2.070811
H  -2.784817 1.549112 2.106152
H  -0.197904 -4.369732 0.063199
