program: Orca
programVersion: 4.2.1
elementType: Cl Cl F F F F O N N N C C C C C C C C C C C C C H H H H H H H H H H H
charge: 0
multiplicity: 1
keywords: wb97x-d3
keywords: def2-TZVPP
keywords: def2/J RIJCOSX GRIDX6 NOFINALGRIDX
keywords: grid4 nofinalgrid
keywords: scfconv7
keywords: smallprint printgap noloewdin
keywords: NOSOSCF
formula: C13H11Cl2F4N3O
InChI: InChI=1S/C13H11Cl2F4N3O/c14-9-1-2-10(11(15)3-9)8(4-22-7-20-6-21-22)5-23-13(18,19)12(16)17/h1-3,6-8,12H,4-5H2
34 atoms
Cl -1.802079 0.141408 -2.905168
Cl -3.248008 3.698228 0.809661
F  4.028087 -1.195346 -0.368987
F  3.845555 0.713234 -1.362158
F  3.616832 -0.022544 2.060761
F  3.379839 1.923954 1.096632
O  2.102197 -0.075267 -0.214829
N  -1.098714 -2.659214 0.763888
N  -1.906415 -3.293568 -0.085386
N  -2.860787 -3.13763 1.933061
C  0.034068 -1.115276 -0.774705
C  0.183984 -2.157869 0.333164
C  1.397136 -0.694548 -1.29905
C  -0.799559 0.078386 -0.375244
C  -1.656006 0.712833 -1.274015
C  -0.716751 0.629245 0.901801
C  3.428121 0.020078 -0.272404
C  -2.413257 1.821161 -0.926266
C  -1.457779 1.734755 1.28198
C  -1.679677 -2.568208 1.961443
C  -2.307001 2.320317 0.359273
C  3.963918 0.711986 0.979965
C  -2.949183 -3.562246 0.658309
H  -0.449231 -1.621778 -1.612654
H  0.776776 -2.993518 -0.041408
H  0.698778 -1.773504 1.211874
H  1.932519 -1.570227 -1.672708
H  1.285483 0.014009 -2.121809
H  -0.053503 0.194794 1.63735
H  -3.071113 2.284392 -1.648503
H  -1.367253 2.130378 2.28404
H  -1.210251 -2.093207 2.809097
H  5.048551 0.828809 0.950203
H  -3.806375 -4.088587 0.267278
elementType: Cl F O N C H
totalener: -2061.44346073 hartree
nucrepener: 2350.76014648 hartree
electener: -4412.20360721 hartree
oneelecener: -7513.35740955 hartree
twoeener: 3101.15380233 hartree
cpcmener: -0.02766628 hartree
kineticenergy: 2055.85923277 hartree
xcener: -143.919876488031 hartree
chargesum: 0.0000000
charge: -0.081164 -0.084405 -0.204068 -0.199522 -0.201816 -0.199583 -0.280263 0.121047 -0.351309 -0.414127 0.108008 -0.177581 -0.030323 0.079484 -0.028693 -0.226805 0.430422 -0.123610 -0.142746 0.077650 0.087210 0.285433 0.067122 0.097818 0.133598 0.123404 0.132208 0.122948 0.138663 0.124178 0.145339 0.172554 0.136839 0.162090
qa: -0.0812 -0.0844 -0.2041 -0.1995 -0.2018 -0.1996 -0.2803 0.1210 -0.3513 -0.4141 0.1080 -0.1776 -0.0303 0.0795 -0.0287 -0.2268 0.4304 -0.1236 -0.1427 0.0777 0.0872 0.2854 0.0671 0.0978 0.1336 0.1234 0.1322 0.1229 0.1387 0.1242 0.1453 0.1726 0.1368 0.1621
va: 1.2437 1.2189 1.0932 1.1005 1.0851 1.0890 2.0994 3.3566 2.8762 3.0286 3.7041 3.9350 3.8813 3.4537 4.0039 3.9725 4.3633 4.0428 4.0472 4.0424 3.8750 4.1221 4.0441 1.0539 1.0053 1.0082 1.0011 1.0091 1.0096 1.0200 1.0046 0.9933 0.9838 0.9943
dispcorr: -0.018682825 hartree
energy: -2061.462143553441
dipole: -7.14986 9.10780 1.95794 -14.68112 14.66665 -0.01447 3.36633 -3.44579 -0.07946
magnitude: 1.95960 au
magnitude: 4.98092 debye
