program: Orca
programVersion: 4.2.1
elementType: Cl Cl F F F F O N N N C C C C C C C C C C C C C H H H H H H H H H H H
charge: 0
multiplicity: 1
keywords: wb97x-d3
keywords: def2-TZVPP
keywords: def2/J RIJCOSX GRIDX6 NOFINALGRIDX
keywords: grid4 nofinalgrid
keywords: scfconv7
keywords: smallprint printgap noloewdin
keywords: NOSOSCF
formula: C13H11Cl2F4N3O
InChI: InChI=1S/C13H11Cl2F4N3O/c14-9-1-2-10(11(15)3-9)8(4-22-7-20-6-21-22)5-23-13(18,19)12(16)17/h1-3,6-8,12H,4-5H2
34 atoms
Cl -1.013959 0.611988 -2.9172
Cl -3.13967 3.502292 1.040525
F  3.685914 -0.81772 -0.976517
F  2.311206 0.834604 -1.160784
F  4.670642 0.251003 1.362729
F  3.267056 1.916261 1.18021
O  2.146424 -0.517501 0.616796
N  -1.586653 -2.721027 0.114898
N  -1.112118 -3.40806 1.159267
N  -3.238477 -2.802663 1.525097
C  0.19031 -1.195434 -0.747725
C  -0.74898 -2.387268 -1.006422
C  1.316392 -1.60003 0.203446
C  -0.604473 0.002535 -0.298282
C  -1.201464 0.868148 -1.212148
C  -0.839439 0.257624 1.050125
C  2.970655 0.074865 -0.247197
C  -1.978448 1.945219 -0.816523
C  -1.614177 1.321107 1.476415
C  -2.855156 -2.360301 0.355229
C  -2.176553 2.165547 0.534728
C  3.953375 0.985979 0.492324
C  -2.136549 -3.432265 1.978583
H  0.634643 -0.977744 -1.72082
H  -1.399455 -2.145094 -1.846629
H  -0.178068 -3.274912 -1.283147
H  0.929407 -2.015436 1.131046
H  1.912377 -2.387991 -0.264221
H  -0.412427 -0.39117 1.802782
H  -2.41995 2.600761 -1.553321
H  -1.777176 1.489637 2.531133
H  -3.447079 -1.78605 -0.341053
H  4.631964 1.480309 -0.208619
H  -2.08915 -3.93264 2.933044
totalener: -2061.41431489 hartree
nucrepener: 2398.48574013 hartree
electener: -4459.90005502 hartree
oneelecener: -7608.95119247 hartree
twoeener: 3149.05113745 hartree
kineticenergy: 2055.86198378 hartree
xcener: -143.921165645538 hartree
chargesum: -0.0000000
charge: -0.073296 -0.063799 -0.194409 -0.192869 -0.177459 -0.175771 -0.273019 0.133437 -0.346485 -0.322075 0.026924 -0.156326 -0.044690 0.005255 -0.015106 -0.113030 0.442717 -0.129493 -0.125685 0.040983 0.089037 0.289109 0.074859 0.092049 0.126890 0.125200 0.124248 0.115243 0.116952 0.115770 0.124598 0.143623 0.080693 0.135922
qa: -0.0733 -0.0638 -0.1944 -0.1929 -0.1775 -0.1758 -0.2730 0.1334 -0.3465 -0.3221 0.0269 -0.1563 -0.0447 0.0053 -0.0151 -0.1130 0.4427 -0.1295 -0.1257 0.0410 0.0890 0.2891 0.0749 0.0920 0.1269 0.1252 0.1242 0.1152 0.1170 0.1158 0.1246 0.1436 0.0807 0.1359
va: 1.2580 1.2405 1.1085 1.1056 1.1167 1.1191 2.1101 3.2664 2.8296 3.0583 3.7446 3.9373 3.9094 3.4341 4.0015 3.9267 4.3054 4.0691 4.0888 4.0785 3.9420 4.1960 4.0282 1.0460 1.0066 1.0106 1.0256 1.0070 1.0124 1.0228 1.0117 1.0008 0.9887 1.0001
dispcorr: -0.020184057 hartree
energy: -2061.434498948225
dipole: -10.68854 11.01907 0.33053 -18.26594 17.99310 -0.27284 3.14062 -4.07079 -0.93017
magnitude: 1.02417 au
magnitude: 2.60323 debye
