program: Orca
programVersion: 4.2.1
elementType: Cl Cl F F F F O N N N C C C C C C C C C C C C C H H H H H H H H H H H
charge: 0
multiplicity: 1
keywords: wb97x-d3
keywords: def2-TZVPP
keywords: def2/J RIJCOSX GRIDX6 NOFINALGRIDX
keywords: grid4 nofinalgrid
keywords: scfconv7
keywords: smallprint printgap noloewdin
keywords: NOSOSCF
formula: C13H11Cl2F4N3O
InChI: InChI=1S/C13H11Cl2F4N3O/c14-9-1-2-10(11(15)3-9)8(4-22-7-20-6-21-22)5-23-13(18,19)12(16)17/h1-3,6-8,12H,4-5H2
34 atoms
Cl -2.446232 -0.774044 -2.299622
Cl -3.229395 3.737497 0.43281
F  4.37262 -0.350921 -1.028785
F  3.25745 1.495888 -0.974339
F  4.465901 -0.389321 1.720994
F  3.304956 1.46084 1.780195
O  2.370026 -0.328316 -0.044354
N  -1.148232 -2.548722 0.779386
N  -1.647295 -3.532559 0.026406
N  -3.196513 -2.784112 1.463508
C  0.187808 -1.112005 -0.685468
C  0.175632 -2.041666 0.535504
C  1.603184 -0.810189 -1.151685
C  -0.660358 0.113572 -0.439358
C  -1.864396 0.336542 -1.107422
C  -0.290281 1.060064 0.517301
C  3.491235 0.35509 -0.281238
C  -2.657705 1.445215 -0.848514
C  -1.061714 2.174209 0.792855
C  -2.090082 -2.105574 1.6247
C  -2.247893 2.360011 0.102813
C  4.165227 0.7311 1.039963
C  -2.873633 -3.643504 0.474964
H  -0.251458 -1.682596 -1.506545
H  0.837078 -2.893669 0.373875
H  0.515028 -1.527507 1.434299
H  2.061939 -1.727846 -1.529441
H  1.574734 -0.080178 -1.963062
H  0.630075 0.933156 1.069001
H  -3.586848 1.584685 -1.382077
H  -0.742472 2.889872 1.537067
H  -1.922932 -1.301503 2.32515
H  5.076003 1.311402 0.870052
H  -3.560841 -4.373308 0.076669
totalener: -2061.41575101 hartree
nucrepener: 2358.73622323 hartree
electener: -4420.15197424 hartree
oneelecener: -7529.22682164 hartree
twoeener: 3109.07484740 hartree
kineticenergy: 2055.85893220 hartree
xcener: -143.917698096833 hartree
chargesum: 0.0000000
charge: -0.058375 -0.063034 -0.186263 -0.190070 -0.176548 -0.184355 -0.292160 0.121116 -0.312955 -0.325400 0.108821 -0.144248 -0.063884 -0.083673 0.040048 -0.164881 0.432526 -0.118329 -0.161338 0.037953 0.096486 0.285494 0.065896 0.098385 0.119166 0.124852 0.125910 0.125889 0.134383 0.115855 0.126968 0.139917 0.095667 0.130182
qa: -0.0584 -0.0630 -0.1863 -0.1901 -0.1765 -0.1844 -0.2922 0.1211 -0.3130 -0.3254 0.1088 -0.1442 -0.0639 -0.0837 0.0400 -0.1649 0.4325 -0.1183 -0.1613 0.0380 0.0965 0.2855 0.0659 0.0984 0.1192 0.1249 0.1259 0.1259 0.1344 0.1159 0.1270 0.1399 0.0957 0.1302
va: 1.2677 1.2419 1.1193 1.1120 1.1194 1.1110 2.0867 3.3077 2.8561 3.0575 3.7098 3.9408 3.9084 3.5500 3.9764 3.9518 4.3616 4.0505 4.0862 4.0801 3.9332 4.1654 4.0531 1.0600 1.0167 1.0025 0.9939 1.0001 1.0279 1.0234 1.0125 1.0033 0.9893 1.0019
dispcorr: -0.019623261 hartree
energy: -2061.435374273561
dipole: -6.02065 7.39180 1.37115 -12.49760 12.98792 0.49032 2.33711 -2.53387 -0.19676
magnitude: 1.46941 au
magnitude: 3.73495 debye
