program: Orca
programVersion: 4.2.1
elementType: Cl Cl F F F F O N N N C C C C C C C C C C C C C H H H H H H H H H H H
charge: 0
multiplicity: 1
keywords: wb97x-d3
keywords: def2-TZVPP
keywords: def2/J RIJCOSX GRIDX6 NOFINALGRIDX
keywords: grid4 nofinalgrid
keywords: scfconv7
keywords: smallprint printgap noloewdin
keywords: NOSOSCF
formula: C13H11Cl2F4N3O
InChI: InChI=1S/C13H11Cl2F4N3O/c14-9-1-2-10(11(15)3-9)8(4-22-7-20-6-21-22)5-23-13(18,19)12(16)17/h1-3,6-8,12H,4-5H2
34 atoms
Cl -1.673235 0.908319 -2.908396
Cl -3.105369 3.317416 1.639804
F  2.872958 -0.437078 1.654054
F  4.050959 -1.302981 0.066039
F  3.229224 2.066406 0.590547
F  4.402671 1.204938 -1.041007
O  2.155962 -0.242928 -0.453032
N  -1.507953 -2.657097 -0.202237
N  -0.808548 -3.343864 0.706538
N  -2.886757 -2.957711 1.45041
C  0.03474 -0.980644 -1.197562
C  -0.894963 -2.185656 -1.415862
C  1.327542 -1.403812 -0.517234
C  -0.709139 0.123435 -0.488357
C  -1.527222 1.012402 -1.182568
C  -0.673859 0.258595 0.896711
C  3.218322 -0.269793 0.350202
C  -2.264564 1.997257 -0.544789
C  -1.402515 1.227317 1.562717
C  -2.743408 -2.426608 0.263573
C  -2.193762 2.097582 0.832985
C  4.013886 1.031978 0.236427
C  -1.675912 -3.503636 1.678115
H  0.307245 -0.6323 -2.197613
H  -1.692904 -1.902873 -2.101921
H  -0.350988 -3.013753 -1.872981
H  1.153132 -1.832738 0.470047
H  1.811213 -2.173816 -1.124723
H  -0.06495 -0.411574 1.487864
H  -2.882598 2.674233 -1.11689
H  -1.353342 1.303095 2.639402
H  -3.490051 -1.878351 -0.290486
H  4.896352 1.007071 0.882766
H  -1.426268 -4.03981 2.58029
totalener: -2061.41704202 hartree
nucrepener: 2374.89284939 hartree
electener: -4436.30989141 hartree
oneelecener: -7561.78296544 hartree
twoeener: 3125.47307402 hartree
kineticenergy: 2055.85599451 hartree
xcener: -143.919135264809 hartree
chargesum: 0.0000000
charge: -0.074105 -0.063652 -0.196290 -0.190899 -0.176400 -0.177754 -0.266960 0.136022 -0.346148 -0.321691 0.075013 -0.163750 -0.081627 0.051360 -0.026566 -0.155702 0.439927 -0.127319 -0.115214 0.044736 0.084436 0.287962 0.073961 0.085702 0.125877 0.121747 0.127314 0.117128 0.113801 0.115523 0.124292 0.142246 0.081615 0.135416
qa: -0.0741 -0.0637 -0.1963 -0.1909 -0.1764 -0.1778 -0.2670 0.1360 -0.3461 -0.3217 0.0750 -0.1637 -0.0816 0.0514 -0.0266 -0.1557 0.4399 -0.1273 -0.1152 0.0447 0.0844 0.2880 0.0740 0.0857 0.1259 0.1217 0.1273 0.1171 0.1138 0.1155 0.1243 0.1422 0.0816 0.1354
va: 1.2592 1.2408 1.1026 1.1137 1.1178 1.1164 2.1136 3.2667 2.8274 3.0581 3.7893 3.9264 3.9191 3.4837 3.9904 3.9315 4.3333 4.0702 4.0818 4.0752 3.9510 4.1917 4.0326 1.0376 1.0099 1.0118 1.0230 1.0083 1.0205 1.0225 1.0116 1.0013 0.9884 1.0002
dispcorr: -0.019574575 hartree
energy: -2061.436616596179
dipole: -9.96763 10.20302 0.23539 -17.39442 17.06656 -0.32786 -0.12002 -0.49800 -0.61803
magnitude: 0.73814 au
magnitude: 1.87621 debye
