program: Orca
programVersion: 4.2.1
elementType: Cl Cl F F F F O N N N C C C C C C C C C C C C C H H H H H H H H H H H
charge: 0
multiplicity: 1
keywords: wb97x-d3
keywords: def2-TZVPP
keywords: def2/J RIJCOSX GRIDX6 NOFINALGRIDX
keywords: grid4 nofinalgrid
keywords: scfconv7
keywords: smallprint printgap noloewdin
keywords: NOSOSCF
formula: C13H11Cl2F4N3O
InChI: InChI=1S/C13H11Cl2F4N3O/c14-9-1-2-10(11(15)3-9)8(4-22-7-20-6-21-22)5-23-13(18,19)12(16)17/h1-3,6-8,12H,4-5H2
34 atoms
Cl -1.72861 0.836761 -2.996772
Cl -3.023007 3.487233 1.457491
F  2.835983 -0.396454 1.54002
F  4.017845 -1.282608 -0.034335
F  5.004715 1.086116 0.834341
F  3.122352 2.086937 0.356054
O  2.104489 -0.268032 -0.565783
N  -1.550321 -2.64522 -0.106791
N  -0.823999 -3.347366 0.768925
N  -2.838772 -2.874052 1.628228
C  -0.040732 -1.016605 -1.226564
C  -0.991999 -2.216526 -1.361747
C  1.263252 -1.421581 -0.555947
C  -0.749508 0.134405 -0.557259
C  -1.553255 1.014126 -1.279356
C  -0.692366 0.327826 0.820184
C  3.173742 -0.257026 0.239006
C  -2.253438 2.046869 -0.676507
C  -1.383953 1.345379 1.452041
C  -2.747208 -2.363715 0.427318
C  -2.159603 2.205991 0.694471
C  3.926373 1.058697 0.028756
C  -1.637636 -3.463447 1.791528
H  0.2103 -0.724461 -2.249923
H  -1.817696 -1.946179 -2.019631
H  -0.478658 -3.06529 -1.816028
H  1.107516 -1.799792 0.454605
H  1.72594 -2.226638 -1.133977
H  -0.094352 -0.333193 1.432541
H  -2.860685 2.715247 -1.269895
H  -1.317374 1.466636 2.5236
H  -3.5049 -1.794164 -0.088892
H  4.248153 1.166946 -1.010198
H  -1.355175 -3.997737 2.684961
totalener: -2061.41707482 hartree
nucrepener: 2369.35466917 hartree
electener: -4430.77174399 hartree
oneelecener: -7550.53702411 hartree
twoeener: 3119.76528012 hartree
kineticenergy: 2055.85803051 hartree
xcener: -143.919765803620 hartree
chargesum: -0.0000000
charge: -0.074826 -0.062382 -0.185603 -0.189056 -0.176770 -0.176935 -0.284287 0.132395 -0.344499 -0.321978 0.076389 -0.159516 -0.086872 0.050907 -0.027460 -0.158364 0.456946 -0.129456 -0.110680 0.042674 0.083029 0.280855 0.074684 0.081737 0.126005 0.122201 0.128804 0.117337 0.115269 0.115865 0.126008 0.143082 0.077942 0.136553
qa: -0.0748 -0.0624 -0.1856 -0.1891 -0.1768 -0.1769 -0.2843 0.1324 -0.3445 -0.3220 0.0764 -0.1595 -0.0869 0.0509 -0.0275 -0.1584 0.4569 -0.1295 -0.1107 0.0427 0.0830 0.2809 0.0747 0.0817 0.1260 0.1222 0.1288 0.1173 0.1153 0.1159 0.1260 0.1431 0.0779 0.1366
va: 1.2587 1.2420 1.1187 1.1139 1.1174 1.1145 2.0837 3.2718 2.8308 3.0576 3.7835 3.9298 3.9377 3.4634 3.9920 3.9301 4.3094 4.0695 4.0760 4.0765 3.9521 4.1861 4.0310 1.0390 1.0093 1.0122 1.0229 1.0096 1.0200 1.0224 1.0110 1.0008 0.9907 1.0000
dispcorr: -0.019527916 hartree
energy: -2061.436602731128
dipole: -11.40703 11.27876 -0.12827 -17.24785 16.96265 -0.28520 -2.92304 1.50185 -1.42119
magnitude: 1.45519 au
magnitude: 3.69880 debye
