program: Gaussian 09
title: 000030741
version: EM64L-G09RevD.01
frameworkgroup: C1[X(C8H21INSi)]
method: RPBEPBE
basis: SDD
operation: Freq
keyword: #p
keyword: freq=noraman
keyword: PBEPBE/SDD
title: #p freq=noraman PBEPBE/SDD
converged: NO YES NO NO
title: Mulliken charges:
elementType: I Si N C C C C C C C C H H H H H H H H H H H H H H H H H H H H H
charge: 0.202730 1.211806 -0.100015 -0.739113 -0.272310 -0.557991 -0.567754 -1.016908 -0.984397 -0.993320 -0.852098 0.273839 0.274524 0.283480 0.307743 0.268721 0.268850 0.271575 0.269454 0.267603 0.274633 0.250784 0.283804 0.232153 0.247559 0.265050 0.247598 0.244168 0.239034 0.275119 0.306697 0.316985
chargesum: 1.00000
title: Mulliken charges with hydrogens summed into heavy atoms:
elementType: I Si N C C C C C C C C
charge: 0.202730 1.211806 -0.100015 -0.190750 0.318913 0.251155 0.243935 -0.250167 -0.224191 -0.234999 -0.228417
polarizability: 1.63344059e+02 -1.15650829e+01 1.28807818e+02 -6.48181347e+00 2.64336653e+00 1.13022106e+02
1716.lowfreq: 0.0013 0.0018 0.0018 6.5709 12.6186 15.2979 22.4059 32.0327 67.0242
frequency: 20.1616 31.7902 66.9456 115.8318 124.9951 135.1342 139.4283 157.8680 159.5557 183.1266 186.4899 201.2096 213.5845 231.8507 241.5822 248.2061 281.0977 316.3771 344.0286 398.0473 458.1597 478.8070 585.1529 612.7760 654.7136 696.3914 706.7115 730.2305 747.4518 751.5849 763.3829 818.2969 841.2301 872.4518 892.7049 903.8592 914.6008 925.6501 967.8551 985.0559 1061.3021 1097.2167 1117.6861 1151.3862 1179.9792 1216.3385 1233.9966 1282.7683 1296.8483 1312.9955 1316.3785 1326.3855 1331.1339 1367.0097 1422.7837 1437.2548 1439.8555 1441.7436 1445.3767 1449.5083 1454.6642 1457.9289 1461.2640 1464.1922 1466.1408 1471.3903 1473.2478 1481.8904 1494.3816 2980.1694 2987.2959 2989.4349 3004.0100 3021.7785 3026.1866 3039.7032 3069.1688 3075.1313 3076.5018 3084.8261 3085.2450 3091.9066 3092.6037 3093.4991 3119.3123 3135.7005 3141.3931 3147.5543 3151.4575 3157.9200
redmass: 3.1184 5.1313 2.4386 1.2306 2.1232 1.5839 2.6272 1.6996 2.6331 1.1783 2.4110 2.6259 2.2562 2.3342 2.0162 1.3172 1.0624 3.1675 2.0343 3.2853 2.4595 2.5196 3.8639 4.5606 3.5419 3.4589 2.8811 1.4043 1.2443 3.2603 1.1478 1.4264 1.6780 2.2994 2.2129 1.5182 1.6233 1.7041 2.5265 1.3824 2.7062 1.3877 1.4056 1.3790 1.3401 1.1904 1.6274 1.3512 1.3660 1.1929 1.1911 1.1640 1.1791 1.2562 1.1399 1.0807 1.0532 1.0735 1.0684 1.0744 1.0676 1.0627 1.0641 1.0737 1.0526 1.0713 1.0516 1.0496 1.0577 1.0357 1.0357 1.0353 1.0593 1.0327 1.0329 1.0620 1.0603 1.0963 1.0969 1.0979 1.0983 1.0976 1.0985 1.0985 1.1043 1.1054 1.1051 1.1049 1.1050 1.1103
irintensity: 0.6029 1.2083 0.1877 0.1088 0.9113 0.6128 2.3286 0.1361 0.5206 0.6952 1.1040 1.5639 2.8370 1.3087 0.2221 0.7469 0.3113 3.9645 0.5079 2.9125 0.0438 3.2147 1.8036 10.7454 8.4836 3.0994 5.8733 5.7057 0.1249 4.6275 19.7494 21.5789 49.4511 28.1215 47.1526 79.0555 67.9368 108.3247 14.0086 7.9429 7.7814 4.7037 2.1309 5.8647 1.4834 10.5645 2.6227 5.5281 5.5728 39.2721 40.7919 1.6888 12.2936 1.2912 13.3333 0.6141 0.2123 5.8845 3.9883 3.1723 8.8890 6.8912 27.1572 5.9601 36.0819 21.1941 8.9183 29.7000 78.3498 7.1960 6.3122 3.6801 4.9181 4.0036 2.5556 6.2355 8.5147 9.9362 3.7458 4.3549 11.6872 6.1277 15.3100 10.4297 1.2774 2.2160 7.3030 3.4448 5.5693 1.7689
temp: 298.150 k
press: 1.00000 atm
elementType: 53 14 7 6 6 6 6 6 6 6 6 1 1 1 1 1 1 1 1 1 1 1 1 1 1 1 1 1 1 1 1 1
symmnumber: 1
zpe: 734675.9 jmol-1
zpe.correction: 0.279823 hartree
zpe.thermalcorrener: 0.296853 hartree
zpe.thermalcorrenthalpy: 0.297797 hartree
zpe.thermalcorrgfe: 0.233563 hartree
zpe.sumelectzpe: -671.926778 hartree
zpe.sumelectthermal: -671.909749 hartree
zpe.sumelectthermalent: -671.908805 hartree
zpe.sumelectthermalfe: -671.973039 hartree
dipole: -6.5278 5.5072 0.2542
dipole: 8.5444
quadrupole: -69.1543 -68.5171 -83.5705
quadrupole: -2.8485 0.1142 0.8672
quadrupole: 4.5930 5.2302 -9.8232 -2.8485 0.1142 0.8672
hfenergy: -672.2066017 hartree
pointgroup: C01 [X(C8H21I1N1Si1)]
dipole: -1.5543703 -2.9748559 -0.1862514 debye
polarizability: 150.477047|20.3032517|141.4927925|4.827948|5.5876888|113.2041432 unknown
InChI: InChI=1S/C8H21INSi/c1-10(2,7-6-9)8-11(3,4)5/h6-8H2,1-5H3
charge 1 multiplicity 1
32 atoms
I  3.61909 2.252277 0.077624
Si -1.924582 0.493341 0.052682
N  0.676862 -1.180312 -0.084356
C  -0.547868 -0.612128 -0.834044
C  1.660241 -0.050083 0.348402
C  0.230279 -1.905624 1.183106
C  1.397784 -2.18774 -0.983719
C  -1.186976 1.903038 1.11187
C  -2.852723 1.194724 -1.458537
C  -3.067954 -0.626609 1.093155
C  2.316168 0.71194 -0.806333
H  -1.077289 -1.490173 -1.25293
H  -0.150209 -0.044577 -1.694589
H  2.428411 -0.539071 0.973014
H  1.074341 0.633798 0.980971
H  1.090924 -2.440581 1.614165
H  -0.150116 -1.171053 1.907069
H  -0.567607 -2.618158 0.925443
H  2.346875 -2.487324 -0.511227
H  0.750821 -3.068836 -1.113083
H  1.590488 -1.73219 -1.965513
H  -0.432393 2.501954 0.569646
H  -2.007989 2.594262 1.380878
H  -0.747441 1.556831 2.065565
H  -3.211251 0.39688 -2.134037
H  -3.740636 1.761949 -1.124748
H  -2.221142 1.885408 -2.045817
H  -3.406658 -1.510096 0.521494
H  -2.605031 -0.976877 2.03262
H  -3.973905 -0.058407 1.374524
H  1.605932 1.268568 -1.433998
H  2.984355 0.096071 -1.423997
