program: Orca
programVersion: 4.2.1
elementType: Cl Cl F F F F O N N N C C C C C C C C C C C C C H H H H H H H H H H H
charge: 0
multiplicity: 1
keywords: wb97x-d3
keywords: def2-TZVPP
keywords: def2/J RIJCOSX GRIDX6 NOFINALGRIDX
keywords: grid4 nofinalgrid
keywords: scfconv7
keywords: smallprint printgap noloewdin
keywords: NOSOSCF
formula: C13H11Cl2F4N3O
InChI: InChI=1S/C13H11Cl2F4N3O/c14-9-1-2-10(11(15)3-9)8(4-22-7-20-6-21-22)5-23-13(18,19)12(16)17/h1-3,6-8,12H,4-5H2
34 atoms
Cl -0.974218 0.827816 -2.948575
Cl -5.059534 2.612432 -0.008765
F  3.263943 0.861304 -0.901043
F  3.883129 1.187674 1.138626
F  4.364411 -1.662154 -0.847363
F  5.029517 -1.317601 1.206046
O  2.463714 -0.478044 0.704885
N  -0.815336 -2.23048 0.484541
N  -0.435597 -2.388768 1.755954
N  -2.579756 -2.990507 1.502833
C  0.293246 -0.153255 -0.31937
C  0.067799 -1.663301 -0.501355
C  1.204938 0.181753 0.861223
C  -1.027958 0.568055 -0.240495
C  -1.680231 1.038231 -1.380042
C  -1.69202 0.738916 0.973101
C  3.513857 0.21481 0.270037
C  -2.912529 1.669589 -1.321629
C  -2.92443 1.36141 1.062216
C  -2.100887 -2.585527 0.354389
C  -3.526746 1.830229 -0.092189
C  4.708218 -0.714999 0.047964
C  -1.524099 -2.847946 2.32785
H  0.81065 0.177965 -1.221346
H  -0.382452 -1.838287 -1.478822
H  1.017416 -2.197115 -0.477278
H  1.320399 1.26508 0.94249
H  0.80854 -0.18889 1.803625
H  -1.248066 0.363513 1.885439
H  -3.385557 2.027654 -2.224785
H  -3.412548 1.471317 2.019918
H  -2.634139 -2.53464 -0.582632
H  5.573786 -0.161405 -0.326485
H  -1.552206 -3.097413 3.377028
totalener: -2061.41608570 hartree
nucrepener: 2340.13765880 hartree
electener: -4401.55374450 hartree
oneelecener: -7492.07170610 hartree
twoeener: 3090.51796160 hartree
kineticenergy: 2055.85701060 hartree
xcener: -143.919099675449 hartree
chargesum: -0.0000000
charge: -0.067355 -0.061244 -0.198245 -0.187804 -0.183422 -0.173402 -0.279732 0.132999 -0.341491 -0.321020 0.070009 -0.123445 -0.048030 -0.014007 -0.008116 -0.167114 0.433782 -0.135477 -0.125373 0.041578 0.088707 0.283827 0.064366 0.084335 0.119087 0.128046 0.133373 0.123488 0.125666 0.117288 0.127052 0.140490 0.085912 0.135269
qa: -0.0674 -0.0612 -0.1982 -0.1878 -0.1834 -0.1734 -0.2797 0.1330 -0.3415 -0.3210 0.0700 -0.1234 -0.0480 -0.0140 -0.0081 -0.1671 0.4338 -0.1355 -0.1254 0.0416 0.0887 0.2838 0.0644 0.0843 0.1191 0.1280 0.1334 0.1235 0.1257 0.1173 0.1271 0.1405 0.0859 0.1353
va: 1.2640 1.2432 1.0983 1.1185 1.1104 1.1222 2.1020 3.2780 2.8089 3.0563 3.7502 3.8888 3.8711 3.5275 4.0067 3.9446 4.3540 4.0676 4.0907 4.0732 3.9459 4.1786 4.0288 1.0580 1.0054 1.0271 1.0081 1.0275 1.0148 1.0223 1.0122 1.0023 0.9888 1.0004
dispcorr: -0.019382661 hartree
energy: -2061.435468365943
dipole: -10.01696 10.25187 0.23491 -8.02223 8.61545 0.59322 6.95166 -7.51573 -0.56406
magnitude: 0.85162 au
magnitude: 2.16465 debye
