program: Orca
programVersion: 4.2.1
elementType: Cl Cl F F F F O N N N C C C C C C C C C C C C C H H H H H H H H H H H
charge: 0
multiplicity: 1
keywords: wb97x-d3
keywords: def2-TZVPP
keywords: def2/J RIJCOSX GRIDX6 NOFINALGRIDX
keywords: grid4 nofinalgrid
keywords: scfconv7
keywords: smallprint printgap noloewdin
keywords: NOSOSCF
formula: C13H11Cl2F4N3O
InChI: InChI=1S/C13H11Cl2F4N3O/c14-9-1-2-10(11(15)3-9)8(4-22-7-20-6-21-22)5-23-13(18,19)12(16)17/h1-3,6-8,12H,4-5H2
34 atoms
Cl -0.960746 0.814445 -2.956133
Cl -5.02516 2.67985 -0.037906
F  3.268724 0.962268 -0.929509
F  3.937139 1.296719 1.092858
F  4.374194 -1.550427 -0.906673
F  5.078039 -1.220165 1.136173
O  2.510371 -0.372698 0.701327
N  -0.764999 -2.149849 0.5379
N  -0.378182 -2.28827 1.809534
N  -2.524364 -2.891567 1.578215
C  0.330519 -0.083628 -0.310797
C  0.11252 -1.598227 -0.461695
C  1.246355 0.276701 0.859048
C  -0.993134 0.633694 -0.241278
C  -1.655034 1.069582 -1.388924
C  -1.648292 0.83783 0.971915
C  3.547854 0.320057 0.237166
C  -2.888095 1.699975 -1.339565
C  -2.881046 1.461073 1.052325
C  -2.051528 -2.505831 0.420673
C  -3.493037 1.895252 -0.110525
C  4.736895 -0.609551 -0.011958
C  -1.463403 -2.73848 2.394561
H  0.842237 0.23262 -1.221247
H  -0.338288 -1.796078 -1.434479
H  1.065162 -2.126096 -0.428364
H  1.351929 1.362024 0.927078
H  0.860586 -0.087237 1.808568
H  -1.19646 0.489758 1.891227
H  -3.368442 2.031194 -2.249074
H  -3.362124 1.598628 2.01002
H  -2.590048 -2.468918 -0.513974
H  5.596631 -0.055547 -0.398854
H  -1.485828 -2.971063 3.447759
totalener: -2061.41609410 hartree
nucrepener: 2340.95591175 hartree
electener: -4402.37200585 hartree
oneelecener: -7493.70248223 hartree
twoeener: 3091.33047638 hartree
kineticenergy: 2055.85732661 hartree
xcener: -143.919128830406 hartree
chargesum: -0.0000000
charge: -0.067435 -0.061173 -0.198311 -0.187658 -0.183881 -0.173415 -0.280037 0.132818 -0.341445 -0.321190 0.072262 -0.125247 -0.048417 -0.016600 -0.008667 -0.165583 0.434462 -0.135419 -0.125509 0.041489 0.089774 0.283215 0.064798 0.085053 0.119583 0.128075 0.133973 0.122706 0.125263 0.117354 0.126924 0.140605 0.086433 0.135199
qa: -0.0674 -0.0612 -0.1983 -0.1877 -0.1839 -0.1734 -0.2800 0.1328 -0.3414 -0.3212 0.0723 -0.1252 -0.0484 -0.0166 -0.0087 -0.1656 0.4345 -0.1354 -0.1255 0.0415 0.0898 0.2832 0.0648 0.0851 0.1196 0.1281 0.1340 0.1227 0.1253 0.1174 0.1269 0.1406 0.0864 0.1352
va: 1.2640 1.2434 1.0982 1.1187 1.1100 1.1222 2.1019 3.2771 2.8099 3.0562 3.7446 3.8872 3.8713 3.5272 4.0081 3.9429 4.3538 4.0675 4.0902 4.0734 3.9446 4.1782 4.0290 1.0576 1.0056 1.0277 1.0078 1.0278 1.0147 1.0223 1.0123 1.0022 0.9889 1.0004
dispcorr: -0.019400185 hartree
energy: -2061.435494287971
dipole: -9.89998 10.13236 0.23237 -7.92068 8.51065 0.58997 7.32770 -7.89785 -0.57015
magnitude: 0.85272 au
magnitude: 2.16744 debye
