program: Orca
programVersion: 4.2.1
elementType: Cl Cl F F F F O N N N C C C C C C C C C C C C C H H H H H H H H H H H
charge: 0
multiplicity: 1
keywords: wb97x-d3
keywords: def2-TZVPP
keywords: def2/J RIJCOSX GRIDX6 NOFINALGRIDX
keywords: grid4 nofinalgrid
keywords: scfconv7
keywords: smallprint printgap noloewdin
keywords: NOSOSCF
formula: C13H11Cl2F4N3O
InChI: InChI=1S/C13H11Cl2F4N3O/c14-9-1-2-10(11(15)3-9)8(4-22-7-20-6-21-22)5-23-13(18,19)12(16)17/h1-3,6-8,12H,4-5H2
34 atoms
Cl -0.871707 0.885671 -2.847103
Cl -3.402594 3.430307 1.109469
F  4.181445 -1.109275 0.484302
F  3.285063 -0.168511 -1.23693
F  3.115432 2.212941 0.134519
F  5.132946 1.377388 0.062125
O  2.120433 -0.282327 0.668675
N  -1.528872 -2.625947 -0.083506
N  -1.105764 -3.277994 1.003737
N  -3.301332 -2.855703 1.15289
C  0.256705 -1.006567 -0.708754
C  -0.611676 -2.210179 -1.111522
C  1.3338 -1.413611 0.292365
C  -0.620164 0.129615 -0.246153
C  -1.191094 1.025188 -1.148224
C  -0.963093 0.289651 1.093761
C  3.327076 -0.122907 0.114537
C  -2.041952 2.042966 -0.746811
C  -1.814018 1.291012 1.524761
C  -2.840415 -2.373568 0.027467
C  -2.346084 2.169628 0.596595
C  3.901232 1.21623 0.581681
C  -2.202522 -3.396156 1.714699
H  0.76947 -0.701579 -1.623258
H  -1.199899 -1.945663 -1.990134
H  0.012615 -3.06274 -1.384023
H  0.914193 -1.819583 1.210802
H  1.946758 -2.207514 -0.142116
H  -0.564166 -0.389796 1.834796
H  -2.459598 2.724317 -1.474068
H  -2.061729 1.384071 2.572399
H  -3.405087 -1.845341 -0.725666
H  3.959093 1.261742 1.672149
H  -2.209676 -3.897248 2.669999
totalener: -2061.41584968 hartree
nucrepener: 2370.14483361 hartree
electener: -4431.56068329 hartree
oneelecener: -7552.11849725 hartree
twoeener: 3120.55781396 hartree
kineticenergy: 2055.86060535 hartree
xcener: -143.920197592923 hartree
chargesum: -0.0000000
charge: -0.070672 -0.062887 -0.187941 -0.187944 -0.177565 -0.177006 -0.291802 0.135973 -0.347553 -0.321207 0.054127 -0.161966 -0.048906 0.032142 -0.025242 -0.140010 0.452407 -0.123110 -0.124434 0.046478 0.083516 0.280842 0.071977 0.088430 0.124091 0.125098 0.126534 0.112661 0.116675 0.116656 0.124321 0.142175 0.078534 0.135609
qa: -0.0707 -0.0629 -0.1879 -0.1879 -0.1776 -0.1770 -0.2918 0.1360 -0.3476 -0.3212 0.0541 -0.1620 -0.0489 0.0321 -0.0252 -0.1400 0.4524 -0.1231 -0.1244 0.0465 0.0835 0.2808 0.0720 0.0884 0.1241 0.1251 0.1265 0.1127 0.1167 0.1167 0.1243 0.1422 0.0785 0.1356
va: 1.2620 1.2416 1.1142 1.1153 1.1141 1.1166 2.0793 3.2672 2.8224 3.0580 3.7623 3.9465 3.9059 3.4937 4.0011 3.9453 4.3317 4.0623 4.0839 4.0732 3.9487 4.1736 4.0332 1.0534 1.0079 1.0079 1.0295 1.0135 1.0127 1.0223 1.0120 1.0015 0.9912 1.0003
dispcorr: -0.019576872 hartree
energy: -2061.435426549358
dipole: -13.10873 13.04127 -0.06745 -18.16625 17.77641 -0.38984 5.39092 -5.46972 -0.07879
magnitude: 0.40340 au
magnitude: 1.02537 debye
