program: Orca
programVersion: 4.2.1
elementType: Cl Cl F F F F O N N N C C C C C C C C C C C C C H H H H H H H H H H H
charge: 0
multiplicity: 1
keywords: wb97x-d3
keywords: def2-TZVPP
keywords: def2/J RIJCOSX GRIDX6 NOFINALGRIDX
keywords: grid4 nofinalgrid
keywords: scfconv7
keywords: smallprint printgap noloewdin
keywords: NOSOSCF
formula: C13H11Cl2F4N3O
InChI: InChI=1S/C13H11Cl2F4N3O/c14-9-1-2-10(11(15)3-9)8(4-22-7-20-6-21-22)5-23-13(18,19)12(16)17/h1-3,6-8,12H,4-5H2
34 atoms
Cl -0.897885 1.078051 -2.794736
Cl -4.914669 2.84075 0.252068
F  3.335572 0.960581 -0.549639
F  3.924005 0.893566 1.52458
F  5.794337 -0.138434 -0.150812
F  4.348767 -1.585916 -0.920154
O  2.463044 -0.614258 0.777457
N  -0.910911 -2.196915 0.314932
N  -0.593335 -2.495961 1.578285
N  -2.75574 -2.941484 1.192408
C  0.324202 -0.110744 -0.235448
C  0.037546 -1.582533 -0.577796
C  1.217345 0.05422 0.99361
C  -0.967702 0.655685 -0.108802
C  -1.599929 1.218973 -1.216907
C  -1.6246 0.780083 1.113928
C  3.546389 0.112798 0.482966
C  -2.806551 1.893146 -1.118972
C  -2.831177 1.444944 1.242428
C  -2.207792 -2.460848 0.105645
C  -3.414461 2.004544 0.119133
C  4.69185 -0.846651 0.15417
C  -1.728601 -2.941119 2.064027
H  0.879413 0.290938 -1.085446
H  -0.381264 -1.638132 -1.582544
H  0.959172 -2.163726 -0.575059
H  1.357927 1.115971 1.209281
H  0.790521 -0.418336 1.875424
H  -1.195981 0.334943 2.001863
H  -3.264653 2.32268 -1.998382
H  -3.31417 1.518465 2.206197
H  -2.698204 -2.291153 -0.840766
H  4.906736 -1.510537 0.995167
H  -1.815099 -3.284626 3.083032
totalener: -2061.41669563 hartree
nucrepener: 2335.64800323 hartree
electener: -4397.06469886 hartree
oneelecener: -7482.94819348 hartree
twoeener: 3085.88349462 hartree
kineticenergy: 2055.85506680 hartree
xcener: -143.919383930087 hartree
chargesum: 0.0000000
charge: -0.065752 -0.060772 -0.186820 -0.187246 -0.175600 -0.183429 -0.299242 0.134524 -0.344394 -0.321408 0.078534 -0.132787 -0.059786 -0.014274 -0.012842 -0.160718 0.449903 -0.132608 -0.125747 0.044290 0.090711 0.280785 0.065686 0.086682 0.121240 0.127328 0.137720 0.120744 0.123491 0.117346 0.126445 0.140554 0.082436 0.135008
qa: -0.0658 -0.0608 -0.1868 -0.1872 -0.1756 -0.1834 -0.2992 0.1345 -0.3444 -0.3214 0.0785 -0.1328 -0.0598 -0.0143 -0.0128 -0.1607 0.4499 -0.1326 -0.1257 0.0443 0.0907 0.2808 0.0657 0.0867 0.1212 0.1273 0.1377 0.1207 0.1235 0.1173 0.1264 0.1406 0.0824 0.1350
va: 1.2664 1.2436 1.1151 1.1165 1.1192 1.1050 2.0720 3.2736 2.8132 3.0572 3.7341 3.8861 3.8882 3.5302 4.0136 3.9363 4.3283 4.0677 4.0931 4.0722 3.9468 4.1678 4.0318 1.0564 1.0066 1.0264 1.0060 1.0301 1.0155 1.0223 1.0123 1.0022 0.9911 1.0005
dispcorr: -0.019362943 hartree
energy: -2061.436058571351
dipole: -11.97978 11.89472 -0.08506 -11.03014 11.05995 0.02981 8.43596 -8.36488 0.07108
magnitude: 0.11479 au
magnitude: 0.29177 debye
