program: Orca
programVersion: 4.2.1
elementType: Cl Cl F F F F O N N N C C C C C C C C C C C C C H H H H H H H H H H H
charge: 0
multiplicity: 1
keywords: wb97x-d3
keywords: def2-TZVPP
keywords: def2/J RIJCOSX GRIDX6 NOFINALGRIDX
keywords: grid4 nofinalgrid
keywords: scfconv7
keywords: smallprint printgap noloewdin
keywords: NOSOSCF
formula: C13H11Cl2F4N3O
InChI: InChI=1S/C13H11Cl2F4N3O/c14-9-1-2-10(11(15)3-9)8(4-22-7-20-6-21-22)5-23-13(18,19)12(16)17/h1-3,6-8,12H,4-5H2
34 atoms
Cl -2.115936 0.015965 -2.833441
Cl -3.542713 3.690576 0.765487
F  3.541664 -1.131997 0.198505
F  4.284398 0.348754 -1.184064
F  5.11153 0.74286 1.38365
F  3.035284 0.838378 2.059424
O  2.17394 0.500023 -0.478872
N  -0.868061 -2.364406 0.655778
N  -1.572668 -3.118294 -0.190458
N  -2.675264 -2.878191 1.746098
C  0.160448 -0.776973 -0.891859
C  0.380784 -1.779718 0.244206
C  1.473792 -0.265696 -1.465122
C  -0.765278 0.3471 -0.492706
C  -1.826333 0.758955 -1.296768
C  -0.585728 1.033699 0.707118
C  3.426883 0.171233 -0.152353
C  -2.684998 1.781337 -0.92072
C  -1.423141 2.058972 1.106001
C  -1.544019 -2.224628 1.804705
C  -2.478025 2.423109 0.28604
C  3.860746 1.063106 1.012638
C  -2.646201 -3.405619 0.5051
H  -0.306271 -1.341757 -1.702064
H  1.045438 -2.577212 -0.091064
H  0.841415 -1.32492 1.120643
H  2.074548 -1.103834 -1.826583
H  1.276805 0.391108 -2.313272
H  0.241598 0.774577 1.353835
H  -3.504535 2.068426 -1.563808
H  -1.256192 2.569603 2.043753
H  -1.177138 -1.648895 2.640641
H  3.817721 2.120898 0.742663
H  -3.435911 -4.020746 0.103449
totalener: -2061.41558625 hartree
nucrepener: 2356.54558938 hartree
electener: -4417.96117563 hartree
oneelecener: -7524.62264648 hartree
twoeener: 3106.66147085 hartree
kineticenergy: 2055.85966630 hartree
xcener: -143.918748517159 hartree
chargesum: -0.0000000
charge: -0.063821 -0.063745 -0.188494 -0.182621 -0.171302 -0.186245 -0.294688 0.120669 -0.313856 -0.331070 0.092011 -0.185608 -0.044749 0.061116 -0.015275 -0.203343 0.451597 -0.119510 -0.132523 0.057589 0.080369 0.280190 0.065598 0.097887 0.127566 0.111205 0.120892 0.116751 0.119252 0.114671 0.125463 0.136338 0.084549 0.133137
qa: -0.0638 -0.0637 -0.1885 -0.1826 -0.1713 -0.1862 -0.2947 0.1207 -0.3139 -0.3311 0.0920 -0.1856 -0.0447 0.0611 -0.0153 -0.2033 0.4516 -0.1195 -0.1325 0.0576 0.0804 0.2802 0.0656 0.0979 0.1276 0.1112 0.1209 0.1168 0.1193 0.1147 0.1255 0.1363 0.0845 0.1331
va: 1.2616 1.2412 1.1081 1.1248 1.1260 1.0968 2.0734 3.3134 2.8578 3.0641 3.6827 3.9539 3.9175 3.4943 4.0249 3.9959 4.3154 4.0384 4.0737 4.0683 3.9446 4.1551 4.0528 1.0594 1.0105 1.0155 1.0027 1.0099 1.0215 1.0223 1.0116 1.0036 0.9921 1.0006
dispcorr: -0.019547418 hartree
energy: -2061.435133664507
dipole: -7.66254 8.46785 0.80530 -10.09889 10.85176 0.75287 0.95328 -1.33895 -0.38566
magnitude: 1.16793 au
magnitude: 2.96865 debye
