program: Orca
programVersion: 4.2.1
elementType: Cl Cl F F F F O N N N C C C C C C C C C C C C C H H H H H H H H H H H
charge: 0
multiplicity: 1
keywords: wb97x-d3
keywords: def2-TZVPP
keywords: def2/J RIJCOSX GRIDX6 NOFINALGRIDX
keywords: grid4 nofinalgrid
keywords: scfconv7
keywords: smallprint printgap noloewdin
keywords: NOSOSCF
formula: C13H11Cl2F4N3O
InChI: InChI=1S/C13H11Cl2F4N3O/c14-9-1-2-10(11(15)3-9)8(4-22-7-20-6-21-22)5-23-13(18,19)12(16)17/h1-3,6-8,12H,4-5H2
34 atoms
Cl -1.487964 -0.072763 -2.917558
Cl -2.533859 3.760325 0.65062
F  3.96939 0.129517 -1.201334
F  2.28348 1.349893 -0.631583
F  2.813562 0.793274 2.047377
F  4.450659 1.737032 0.95007
O  2.294356 -0.811585 -0.071529
N  -1.353356 -2.848796 0.78686
N  -2.176609 -3.396352 -0.108881
N  -3.258774 -3.015061 1.816005
C  0.072102 -1.511066 -0.692959
C  0.007661 -2.540932 0.436058
C  1.504623 -1.295933 -1.161298
C  -0.596095 -0.202907 -0.352099
C  -1.324471 0.51663 -1.297152
C  -0.469995 0.372575 0.909118
C  3.027373 0.2973 -0.240262
C  -1.925486 1.729986 -1.001986
C  -1.054634 1.582949 1.233524
C  -2.016865 -2.621773 1.928713
C  -1.788065 2.253924 0.270526
C  3.73652 0.606303 1.080345
C  -3.306458 -3.47853 0.550439
H  -0.450686 -1.961906 -1.540027
H  0.501344 -3.4598 0.11335
H  0.518672 -2.205355 1.337591
H  1.942417 -2.240853 -1.49337
H  1.512083 -0.611222 -2.011207
H  0.112121 -0.126586 1.67127
H  -2.489762 2.257557 -1.757365
H  -0.9342 2.00186 2.222216
H  -1.560145 -2.179489 2.800954
H  4.399949 -0.211043 1.373232
H  -4.197227 -3.890581 0.103457
totalener: -2061.41497968 hartree
nucrepener: 2391.36362840 hartree
electener: -4452.77860808 hartree
oneelecener: -7594.56740565 hartree
twoeener: 3141.78879756 hartree
kineticenergy: 2055.86714162 hartree
xcener: -143.920633707525 hartree
chargesum: 0.0000000
charge: -0.068475 -0.064954 -0.186521 -0.175272 -0.185701 -0.172213 -0.310592 0.120630 -0.314931 -0.332482 0.096681 -0.168097 -0.061450 0.109382 -0.018987 -0.267071 0.461507 -0.126524 -0.104422 0.059562 0.082131 0.281834 0.069787 0.103496 0.115242 0.120282 0.111258 0.121939 0.116668 0.114411 0.124192 0.133844 0.081000 0.133846
qa: -0.0685 -0.0650 -0.1865 -0.1753 -0.1857 -0.1722 -0.3106 0.1206 -0.3149 -0.3325 0.0967 -0.1681 -0.0615 0.1094 -0.0190 -0.2671 0.4615 -0.1265 -0.1044 0.0596 0.0821 0.2818 0.0698 0.1035 0.1152 0.1203 0.1113 0.1219 0.1167 0.1144 0.1242 0.1338 0.0810 0.1338
va: 1.2611 1.2398 1.1195 1.1275 1.0989 1.1243 2.0570 3.3183 2.8606 3.0662 3.6821 3.9450 3.9378 3.4176 4.0457 3.9945 4.3169 4.0592 4.0735 4.0690 3.9586 4.1656 4.0499 1.0528 1.0089 1.0024 1.0041 1.0121 1.0207 1.0225 1.0110 1.0037 0.9920 1.0002
dispcorr: -0.019778670 hartree
energy: -2061.434758354459
dipole: -7.79373 9.00038 1.20665 -20.57378 19.85024 -0.72354 4.63961 -4.53309 0.10652
magnitude: 1.41098 au
magnitude: 3.58642 debye
