program: Orca
programVersion: 4.2.1
elementType: Cl Cl F F F F O N N N C C C C C C C C C C C C C H H H H H H H H H H H
charge: 0
multiplicity: 1
keywords: wb97x-d3
keywords: def2-TZVPP
keywords: def2/J RIJCOSX GRIDX6 NOFINALGRIDX
keywords: grid4 nofinalgrid
keywords: scfconv7
keywords: smallprint printgap noloewdin
keywords: NOSOSCF
formula: C13H11Cl2F4N3O
InChI: InChI=1S/C13H11Cl2F4N3O/c14-9-1-2-10(11(15)3-9)8(4-22-7-20-6-21-22)5-23-13(18,19)12(16)17/h1-3,6-8,12H,4-5H2
34 atoms
Cl -0.987977 0.499065 -2.950775
Cl -3.290077 3.448064 0.862362
F  3.616615 -0.806114 -0.905108
F  2.254417 0.859409 -1.067881
F  4.646651 0.233094 1.413453
F  3.236731 1.899161 1.295167
O  2.090366 -0.502458 0.701203
N  -1.604825 -2.764354 0.139773
N  -1.152344 -3.413251 1.217883
N  -3.302285 -2.844515 1.494922
C  0.176335 -1.231745 -0.699878
C  -0.736313 -2.443351 -0.961539
C  1.275313 -1.59942 0.296615
C  -0.650318 -0.035839 -0.305486
C  -1.233975 0.794846 -1.259524
C  -0.93044 0.25029 1.027859
C  2.914593 0.087777 -0.164674
C  -2.042384 1.866744 -0.916589
C  -1.737507 1.309563 1.402004
C  -2.887592 -2.423758 0.327736
C  -2.286572 2.117928 0.42173
C  3.910525 0.985336 0.573587
C  -2.204323 -3.439872 2.001548
H  0.649863 -1.030524 -1.662968
H  -1.362833 -2.231641 -1.827798
H  -0.142917 -3.327681 -1.198357
H  0.862444 -1.987049 1.224925
H  1.887974 -2.398785 -0.128022
H  -0.514224 -0.36955 1.81044
H  -2.472648 2.494563 -1.683518
H  -1.935828 1.502562 2.446438
H  -3.466596 -1.880666 -0.403702
H  4.573978 1.496194 -0.129974
H  -2.179362 -3.913572 2.970491
totalener: -2061.41430316 hartree
nucrepener: 2397.63140734 hartree
electener: -4459.04571050 hartree
oneelecener: -7607.23434955 hartree
twoeener: 3148.18863905 hartree
kineticenergy: 2055.85969682 hartree
xcener: -143.920759089047 hartree
chargesum: 0.0000000
charge: -0.073374 -0.063697 -0.195062 -0.192773 -0.177729 -0.175732 -0.273970 0.133513 -0.346647 -0.321746 0.024687 -0.157360 -0.041316 0.003745 -0.013406 -0.111464 0.443581 -0.130687 -0.126971 0.041130 0.090222 0.289678 0.074892 0.092435 0.126822 0.125128 0.123768 0.114876 0.116590 0.115801 0.124811 0.143462 0.080870 0.135923
qa: -0.0734 -0.0637 -0.1951 -0.1928 -0.1777 -0.1757 -0.2740 0.1335 -0.3466 -0.3217 0.0247 -0.1574 -0.0413 0.0037 -0.0134 -0.1115 0.4436 -0.1307 -0.1270 0.0411 0.0902 0.2897 0.0749 0.0924 0.1268 0.1251 0.1238 0.1149 0.1166 0.1158 0.1248 0.1435 0.0809 0.1359
va: 1.2580 1.2406 1.1077 1.1058 1.1165 1.1188 2.1109 3.2661 2.8295 3.0584 3.7419 3.9394 3.9095 3.4317 4.0018 3.9263 4.2999 4.0701 4.0897 4.0784 3.9407 4.1970 4.0284 1.0468 1.0066 1.0106 1.0255 1.0067 1.0127 1.0228 1.0117 1.0008 0.9887 1.0000
dispcorr: -0.020180835 hartree
energy: -2061.434483999335
dipole: -10.60420 10.95098 0.34678 -18.20104 17.92310 -0.27794 3.33442 -4.24784 -0.91342
magnitude: 1.01580 au
magnitude: 2.58196 debye
