program: Orca
programVersion: 4.2.1
elementType: Cl Cl F F F F O N N N C C C C C C C C C C C C C H H H H H H H H H H H
charge: 0
multiplicity: 1
keywords: wb97x-d3
keywords: def2-TZVPP
keywords: def2/J RIJCOSX GRIDX6 NOFINALGRIDX
keywords: grid4 nofinalgrid
keywords: scfconv7
keywords: smallprint printgap noloewdin
keywords: NOSOSCF
formula: C13H11Cl2F4N3O
InChI: InChI=1S/C13H11Cl2F4N3O/c14-9-1-2-10(11(15)3-9)8(4-22-7-20-6-21-22)5-23-13(18,19)12(16)17/h1-3,6-8,12H,4-5H2
34 atoms
Cl -2.626525 0.516494 -2.512729
Cl -2.303734 5.115861 0.177789
F  2.938869 -2.05603 -0.453582
F  3.087316 -0.095036 -1.341978
F  3.154858 -0.985809 2.050723
F  3.288929 1.01822 1.19121
O  1.37979 -0.530927 0.027266
N  -0.733955 -2.871122 0.973617
N  -1.514315 -3.704555 0.281247
N  0.300458 -4.779786 1.04102
C  -0.96485 -0.754427 -0.253508
C  -1.06523 -1.475713 1.095547
C  0.392284 -0.959225 -0.912466
C  -1.30861 0.71106 -0.139275
C  -2.059853 1.367067 -1.114637
C  -0.854675 1.488206 0.924325
C  2.670006 -0.74644 -0.231331
C  -2.372618 2.714605 -1.027812
C  -1.150086 2.835112 1.03743
C  0.350901 -3.526527 1.412642
C  -1.916656 3.440881 0.057266
C  3.519579 -0.285673 0.95423
C  -0.857882 -4.837787 0.352695
H  -1.689283 -1.235856 -0.913721
H  -0.391914 -1.055259 1.840037
H  -2.080488 -1.385341 1.481893
H  0.532055 -2.011876 -1.168308
H  0.453829 -0.371578 -1.831296
H  -0.241165 1.041283 1.693983
H  -2.961767 3.1884 -1.799743
H  -0.781672 3.40711 1.876946
H  1.135253 -3.052456 1.982831
H  4.585063 -0.440162 0.766241
H  -1.229037 -5.739841 -0.107821
totalener: -2061.41778272 hartree
nucrepener: 2353.98587009 hartree
electener: -4415.40365280 hartree
oneelecener: -7519.56865332 hartree
twoeener: 3104.16500052 hartree
kineticenergy: 2055.85955457 hartree
xcener: -143.918432969312 hartree
chargesum: 0.0000000
charge: -0.065842 -0.063897 -0.185295 -0.185429 -0.188062 -0.178040 -0.280858 0.093555 -0.316965 -0.326833 0.129832 -0.165515 -0.075288 -0.014515 -0.025937 -0.140239 0.427425 -0.130008 -0.149160 0.049096 0.089502 0.280205 0.064968 0.114942 0.113163 0.129072 0.137424 0.132420 0.114489 0.116593 0.125248 0.138811 0.100483 0.134656
qa: -0.0658 -0.0639 -0.1853 -0.1854 -0.1881 -0.1780 -0.2809 0.0936 -0.3170 -0.3268 0.1298 -0.1655 -0.0753 -0.0145 -0.0259 -0.1402 0.4274 -0.1300 -0.1492 0.0491 0.0895 0.2802 0.0650 0.1149 0.1132 0.1291 0.1374 0.1324 0.1145 0.1166 0.1252 0.1388 0.1005 0.1347
va: 1.2605 1.2409 1.1132 1.1216 1.1012 1.1171 2.0858 3.3043 2.8508 3.0631 3.6231 3.9634 3.8955 3.5557 4.0436 3.9996 4.3564 4.0518 4.0790 4.0617 3.9322 4.1591 4.0425 1.0504 1.0018 1.0075 0.9924 1.0093 1.0220 1.0221 1.0130 1.0166 0.9897 1.0007
dispcorr: -0.019002872 hartree
energy: -2061.436785589009
dipole: -7.28972 7.51508 0.22536 -12.67725 13.40535 0.72810 5.31691 -5.10604 0.21087
magnitude: 0.79081 au
magnitude: 2.01008 debye
