program: Orca
programVersion: 4.2.1
elementType: Cl Cl F F F F O N N N C C C C C C C C C C C C C H H H H H H H H H H H
charge: 0
multiplicity: 1
keywords: wb97x-d3
keywords: def2-TZVPP
keywords: def2/J RIJCOSX GRIDX6 NOFINALGRIDX
keywords: grid4 nofinalgrid
keywords: scfconv7
keywords: smallprint printgap noloewdin
keywords: NOSOSCF
formula: C13H11Cl2F4N3O
InChI: InChI=1S/C13H11Cl2F4N3O/c14-9-1-2-10(11(15)3-9)8(4-22-7-20-6-21-22)5-23-13(18,19)12(16)17/h1-3,6-8,12H,4-5H2
34 atoms
Cl -1.85587 0.074926 -2.862409
Cl -3.220163 3.694703 0.817534
F  4.103188 -1.12466 -0.429921
F  3.776538 0.794954 -1.35965
F  3.632684 -0.004588 2.052775
F  3.383171 1.945816 1.100459
O  2.119467 -0.132174 -0.185948
N  -1.117647 -2.67108 0.759843
N  -1.906253 -3.306572 -0.108626
N  -2.922465 -3.123908 1.880711
C  0.041298 -1.131825 -0.757996
C  0.17041 -2.175845 0.353169
C  1.410989 -0.723511 -1.276474
C  -0.783977 0.06838 -0.361641
C  -1.671728 0.674838 -1.248341
C  -0.663471 0.650913 0.897662
C  3.435909 0.049339 -0.282888
C  -2.425057 1.784908 -0.898532
C  -1.400076 1.758612 1.275355
C  -1.741678 -2.565321 1.941128
C  -2.285399 2.317642 0.369762
C  3.963291 0.738637 0.976844
C  -2.976366 -3.55946 0.605583
H  -0.45323 -1.636046 -1.591157
H  0.76937 -3.013487 -0.009915
H  0.67451 -1.785347 1.236209
H  1.94157 -1.601703 -1.655531
H  1.304108 -0.006083 -2.09277
H  0.034529 0.239654 1.614013
H  -3.10905 2.225935 -1.609252
H  -1.281827 2.185133 2.261182
H  -1.301653 -2.084001 2.8012
H  5.049366 0.85764 0.939109
H  -3.825662 -4.080835 0.192981
totalener: -2061.41669363 hartree
nucrepener: 2351.38663975 hartree
electener: -4412.80333339 hartree
oneelecener: -7514.58036235 hartree
twoeener: 3101.77702896 hartree
kineticenergy: 2055.86478442 hartree
xcener: -143.919484146383 hartree
chargesum: -0.0000000
charge: -0.067945 -0.064984 -0.193721 -0.185977 -0.186287 -0.177160 -0.274826 0.125041 -0.316087 -0.332614 0.087315 -0.195523 -0.041440 0.070535 -0.023363 -0.205008 0.424108 -0.123235 -0.118327 0.059125 0.080130 0.282179 0.068569 0.107848 0.117113 0.121499 0.119287 0.123793 0.112939 0.114867 0.124203 0.135309 0.098935 0.133701
qa: -0.0679 -0.0650 -0.1937 -0.1860 -0.1863 -0.1772 -0.2748 0.1250 -0.3161 -0.3326 0.0873 -0.1955 -0.0414 0.0705 -0.0234 -0.2050 0.4241 -0.1232 -0.1183 0.0591 0.0801 0.2822 0.0686 0.1078 0.1171 0.1215 0.1193 0.1238 0.1129 0.1149 0.1242 0.1353 0.0989 0.1337
va: 1.2580 1.2395 1.1065 1.1199 1.1052 1.1193 2.1040 3.3096 2.8582 3.0660 3.7135 3.9661 3.8879 3.5135 4.0317 3.9980 4.3675 4.0462 4.0623 4.0675 3.9497 4.1666 4.0502 1.0511 1.0102 1.0059 1.0012 1.0075 1.0194 1.0225 1.0117 1.0035 0.9902 1.0002
dispcorr: -0.018704123 hartree
energy: -2061.435397753177
dipole: -7.11442 8.44939 1.33496 -14.77164 14.86758 0.09594 3.37343 -3.49887 -0.12543
magnitude: 1.34427 au
magnitude: 3.41687 debye
